ACCESSION: MSBNK-Fac_Eng_Univ_Tokyo-JP012372
RECORD_TITLE: BENZO(K)FLUORANTHENE; CI-B; MS
DATE: 2016.01.19 (Created 2008.10.21, modified 2011.05.06)
AUTHORS: IIDA Y, DAISHIMA S, FAC. OF ENGINEERING, SEIKEI UNIV.
LICENSE: CC BY-NC-SA

CH$NAME: BENZO(K)FLUORANTHENE
CH$COMPOUND_CLASS: N/A
CH$FORMULA: C20H12
CH$EXACT_MASS: 252.09390
CH$SMILES: c(c5)cc(c1)c(c5)cc(c32)c1c(c4)c(c(cc4)ccc3)2
CH$IUPAC: InChI=1S/C20H12/c1-2-6-15-12-19-17-10-4-8-13-7-3-9-16(20(13)17)18(19)11-14(15)5-1/h1-12H
CH$LINK: CAS 207-08-9
CH$LINK: INCHIKEY HAXBIWFMXWRORI-UHFFFAOYSA-N
CH$LINK: COMPTOX DTXSID0023909

AC$INSTRUMENT: FINNIGAN-MAT 4500
AC$INSTRUMENT_TYPE: CI-B
AC$MASS_SPECTROMETRY: MS_TYPE MS
AC$MASS_SPECTROMETRY: ION_MODE POSITIVE
AC$MASS_SPECTROMETRY: IONIZATION_ENERGY 120 eV
AC$MASS_SPECTROMETRY: REAGENT_GAS METHANE

PK$SPLASH: splash10-0udi-0090000000-15ee9499fa569e27c2c8
PK$NUM_PEAK: 8
PK$PEAK: m/z int. rel.int.
  252 17.13 171
  253 99.99 999
  254 20.76 208
  255 3.1 31
  281 21.27 213
  282 4.95 50
  293 4.23 42
  294 1 10