ACCESSION: MSBNK-Fac_Eng_Univ_Tokyo-JP011980
RECORD_TITLE: DIMETHYLPHENYLSILANE; EI-B; MS
DATE: 2016.01.19 (Created 2008.10.21, modified 2011.05.06)
AUTHORS: YAMAMOTO M, DEP. CHEMISTRY, FAC. SCIENCE, NARA WOMEN'S UNIV.
LICENSE: CC BY-NC-SA

CH$NAME: DIMETHYLPHENYLSILANE
CH$COMPOUND_CLASS: N/A
CH$FORMULA: C8H12Si
CH$EXACT_MASS: 136.07083
CH$SMILES: C[SiH](C)c(c1)cccc1
CH$IUPAC: InChI=1S/C8H12Si/c1-9(2)8-6-4-3-5-7-8/h3-7,9H,1-2H3
CH$LINK: INCHIKEY ZISUALSZTAEPJH-UHFFFAOYSA-N
CH$LINK: COMPTOX DTXSID70871805

AC$INSTRUMENT: HITACHI RMU-6M
AC$INSTRUMENT_TYPE: EI-B
AC$MASS_SPECTROMETRY: MS_TYPE MS
AC$MASS_SPECTROMETRY: ION_MODE POSITIVE
AC$MASS_SPECTROMETRY: IONIZATION_ENERGY 20 eV

MS$FOCUSED_ION: ION_TYPE [M]+*

PK$SPLASH: splash10-05g0-3900000000-46111a2a81b760dbb2a8
PK$NUM_PEAK: 20
PK$PEAK: m/z int. rel.int.
  43 12.6 126
  58 68.4 684
  59 6.7 67
  60 2.5 25
  69 1.2 12
  91 1.5 15
  95 2.7 27
  105 6.2 62
  106 2 20
  107 2.5 25
  119 2.5 25
  120 4.7 47
  121 99.99 999
  122 12.8 128
  123 4.4 44
  134 1.4 14
  135 29.1 291
  136 61.3 613
  137 10.1 101
  138 3.2 32