ACCESSION: MSBNK-Fac_Eng_Univ_Tokyo-JP011935
RECORD_TITLE: DIMETHYL(PHENYLETHYNYL)SILANE; EI-B; MS
DATE: 2016.01.19 (Created 2008.10.21, modified 2011.05.06)
AUTHORS: ISHIKAWA M, HIROSHIMA UNIV. FAC. TEQUNOLOGY
LICENSE: CC BY-NC-SA

CH$NAME: DIMETHYL(PHENYLETHYNYL)SILANE
CH$COMPOUND_CLASS: N/A
CH$FORMULA: C10H12Si
CH$EXACT_MASS: 160.07083
CH$SMILES: C[SiH](C)C#Cc(c1)cccc1
CH$IUPAC: InChI=1S/C10H12Si/c1-11(2)9-8-10-6-4-3-5-7-10/h3-7,11H,1-2H3
CH$LINK: INCHIKEY JPQVPTPDZWZPQT-UHFFFAOYSA-N

AC$INSTRUMENT: SHIMADZU QP-1000
AC$INSTRUMENT_TYPE: EI-B
AC$MASS_SPECTROMETRY: MS_TYPE MS
AC$MASS_SPECTROMETRY: ION_MODE POSITIVE
AC$MASS_SPECTROMETRY: IONIZATION_ENERGY 70 eV

MS$FOCUSED_ION: ION_TYPE [M]+*

PK$SPLASH: splash10-0zfr-9300000000-ef701f4bd786f0899a4c
PK$NUM_PEAK: 45
PK$PEAK: m/z int. rel.int.
  50 13.2 132
  51 22.1 221
  52 14.7 147
  53 99.99 999
  54 10.5 105
  55 14.7 147
  57 8.9 89
  58 72.6 726
  59 7.4 74
  60 2.1 21
  62 4.2 42
  63 10.5 105
  64 7.9 79
  65 11.1 111
  66 11.6 116
  67 17.9 179
  68 1.1 11
  69 1.1 11
  72 6.3 63
  73 2.6 26
  74 3.2 32
  75 2.6 26
  76 5.3 53
  77 22.1 221
  78 5.3 53
  79 8.4 84
  80 2.1 21
  83 2.1 21
  89 3.2 32
  90 1.1 11
  91 3.2 32
  93 2.1 21
  101 1.1 11
  103 6.3 63
  105 13.2 132
  115 1.1 11
  117 1.1 11
  129 8.4 84
  143 3.2 32
  145 69.5 695
  146 10.5 105
  147 2.1 21
  159 11.6 116
  160 21.6 216
  161 3.2 32