ACCESSION: MSBNK-Fac_Eng_Univ_Tokyo-JP011689
RECORD_TITLE: DI(5-(2-BROMOTHIENYL))METHYLPHENYLSILANE; EI-B; MS
DATE: 2016.01.19 (Created 2008.10.21, modified 2011.05.06)
AUTHORS: FAC. TECHNOLOGY, HIROSHIMA UNIV.
LICENSE: CC BY-NC-SA

CH$NAME: DI(5-(2-BROMOTHIENYL))METHYLPHENYLSILANE
CH$COMPOUND_CLASS: N/A
CH$FORMULA: C15H12Br2S2Si
CH$EXACT_MASS: 441.85164
CH$SMILES: c(c3)ccc(c3)[Si](C)(c(c2)sc(Br)c2)c(c1)sc(Br)c1
CH$IUPAC: InChI=1S/C15H12Br2S2Si/c1-20(11-5-3-2-4-6-11,14-9-7-12(16)18-14)15-10-8-13(17)19-15/h2-10H,1H3
CH$LINK: INCHIKEY JWROVZUCWZMWIQ-UHFFFAOYSA-N

AC$INSTRUMENT: SHIMADZU QP-1000
AC$INSTRUMENT_TYPE: EI-B
AC$MASS_SPECTROMETRY: MS_TYPE MS
AC$MASS_SPECTROMETRY: ION_MODE POSITIVE
AC$MASS_SPECTROMETRY: IONIZATION_ENERGY 70 eV

MS$FOCUSED_ION: ION_TYPE [M]+*

PK$SPLASH: splash10-004i-6400900000-a5a63c400996875f1f1e
PK$NUM_PEAK: 41
PK$PEAK: m/z int. rel.int.
  51 24.5 245
  52 6.4 64
  53 36.2 362
  57 8.5 85
  63 9.6 96
  65 7.4 74
  67 5.3 53
  69 8.5 85
  75 13.8 138
  76 5.3 53
  77 26.6 266
  78 3.2 32
  79 8.5 85
  81 5.3 53
  82 21.3 213
  85 6.4 64
  89 4.3 43
  91 25.5 255
  93 7.4 74
  102 5.3 53
  103 5.3 53
  105 28.7 287
  106 5.3 53
  107 22.3 223
  109 26.6 266
  115 16 160
  119 11.7 117
  120 13.8 138
  126 5.3 53
  127 7.4 74
  129 8.5 85
  199 10.6 106
  201 11.7 117
  427 47.9 479
  429 99.99 999
  430 23.4 234
  431 60.6 606
  432 12.8 128
  442 22.3 223
  444 45.7 457
  446 28.7 287