ACCESSION: MSBNK-Fac_Eng_Univ_Tokyo-JP011562
RECORD_TITLE: 1,1,1-TRIMETHYLDISILANE; EI-B; MS
DATE: 2016.01.19 (Created 2008.10.21, modified 2011.05.06)
AUTHORS: YAMAMOTO M, DEP. CHEMISTRY, FAC. SCIENCE, NARA WOMEN'S UNIV.
LICENSE: CC BY-NC-SA

CH$NAME: 1,1,1-TRIMETHYLDISILANE
CH$COMPOUND_CLASS: N/A
CH$FORMULA: C3H12Si2
CH$EXACT_MASS: 104.04775
CH$SMILES: C[Si](C)(C)[SiH3]
CH$IUPAC: InChI=1S/C3H12Si2/c1-5(2,3)4/h1-4H3
CH$LINK: INCHIKEY ZVGUNGATIFIZOL-UHFFFAOYSA-N
CH$LINK: COMPTOX DTXSID40275851

AC$INSTRUMENT: HITACHI RMU-6M
AC$INSTRUMENT_TYPE: EI-B
AC$MASS_SPECTROMETRY: MS_TYPE MS
AC$MASS_SPECTROMETRY: ION_MODE POSITIVE
AC$MASS_SPECTROMETRY: IONIZATION_ENERGY 20 eV

MS$FOCUSED_ION: ION_TYPE [M]+*

PK$SPLASH: splash10-00di-9200000000-4e5960211e187c81d49d
PK$NUM_PEAK: 21
PK$PEAK: m/z int. rel.int.
  43 3 30
  45 5.9 59
  59 3 30
  72 1 10
  73 99.99 999
  74 8.1 81
  75 3 30
  85 3 30
  86 2.2 22
  87 11.1 111
  88 1 10
  89 16.3 163
  90 2.2 22
  91 1 10
  99 1 10
  100 1 10
  101 3 30
  102 14.1 141
  103 13.3 133
  104 8.9 89
  105 2.2 22