ACCESSION: MSBNK-Fac_Eng_Univ_Tokyo-JP011353
RECORD_TITLE: 1,1,1,2-TETRAMETHYLDISILANE; EI-B; MS
DATE: 2016.01.19 (Created 2008.10.21, modified 2011.05.06)
AUTHORS: YAMAMOTO M, DEP. CHEMISTRY, FAC. SCIENCE, NARA WOMEN'S UNIV.
LICENSE: CC BY-NC-SA

CH$NAME: 1,1,1,2-TETRAMETHYLDISILANE
CH$COMPOUND_CLASS: N/A
CH$FORMULA: C4H14Si2
CH$EXACT_MASS: 118.06340
CH$SMILES: C[SiH2][Si](C)(C)C
CH$IUPAC: InChI=1S/C4H14Si2/c1-5-6(2,3)4/h5H2,1-4H3
CH$LINK: INCHIKEY VIPCDVWYAADTGR-UHFFFAOYSA-N

AC$INSTRUMENT: HITACHI RMU-6M
AC$INSTRUMENT_TYPE: EI-B
AC$MASS_SPECTROMETRY: MS_TYPE MS
AC$MASS_SPECTROMETRY: ION_MODE POSITIVE
AC$MASS_SPECTROMETRY: IONIZATION_ENERGY 70 eV

MS$FOCUSED_ION: ION_TYPE [M]+*

PK$SPLASH: splash10-00di-9100000000-f1a302d201c6817f3982
PK$NUM_PEAK: 33
PK$PEAK: m/z int. rel.int.
  28 1.4 14
  29 3.2 32
  31 3.2 32
  42 2.1 21
  43 18.8 188
  44 3.2 32
  45 14.2 142
  46 1 10
  53 1.6 16
  55 1.8 18
  57 1.5 15
  58 1.5 15
  59 8.3 83
  69 3.3 33
  70 1.3 13
  71 1.3 13
  72 1.6 16
  73 99.99 999
  74 9.2 92
  75 3.9 39
  81 1.2 12
  85 2.1 21
  86 1 10
  87 1.2 12
  101 3.8 38
  102 3.1 31
  103 13.2 132
  104 2.2 22
  105 0.9 9
  116 2.4 24
  117 3.2 32
  118 9.6 96
  119 1.7 17