ACCESSION: MSBNK-Fac_Eng_Univ_Tokyo-JP011083
RECORD_TITLE: VELBANAMINE; EI-B; MS
DATE: 2016.01.19 (Created 2008.10.21, modified 2011.05.06)
AUTHORS: YAMAMOTO M, DEP. CHEMISTRY, FAC. SCIENCE, NARA WOMEN'S UNIV.
LICENSE: CC BY-NC-SA

CH$NAME: VELBANAMINE
CH$COMPOUND_CLASS: N/A
CH$FORMULA: C19H26N2O
CH$EXACT_MASS: 298.20451
CH$SMILES: N/A
CH$IUPAC: N/A

AC$INSTRUMENT: HITACHI M-80
AC$INSTRUMENT_TYPE: EI-B
AC$MASS_SPECTROMETRY: MS_TYPE MS
AC$MASS_SPECTROMETRY: ION_MODE POSITIVE
AC$MASS_SPECTROMETRY: IONIZATION_ENERGY 70 eV

MS$FOCUSED_ION: ION_TYPE [M]+*

PK$SPLASH: splash10-0udi-4910000000-1f4865869c9f1f432752
PK$NUM_PEAK: 79
PK$PEAK: m/z int. rel.int.
  18 2.33 23
  27 2.1 21
  28 5.42 54
  29 4.12 41
  30 2.25 23
  39 3.15 32
  40 4.11 41
  42 11.41 114
  43 6.15 62
  44 5.1 51
  55 5.25 53
  56 2.15 22
  57 7.1 71
  58 5.99 60
  67 3.11 31
  68 13.24 132
  69 3.1 31
  70 7.1 71
  71 1.7 17
  75 2.15 22
  77 6.92 69
  81 2.11 21
  82 4.93 49
  83 3.11 31
  84 3.33 33
  91 2.1 21
  95 5.95 60
  96 3.1 31
  98 1.9 19
  100 2.12 21
  102 1.94 19
  110 3.1 31
  115 4.9 49
  117 2.11 21
  122 1.97 20
  124 7 70
  127 2.11 21
  128 3.75 38
  129 4.1 41
  130 5.89 59
  134 2.1 21
  135 2.75 28
  136 6.18 62
  138 2 20
  140 6.91 69
  141 4.11 41
  142 6.12 61
  143 10.28 103
  144 9.13 91
  145 2.13 21
  149 3.11 31
  153 6.9 69
  154 99.99 999
  155 14.17 142
  156 8.9 89
  157 7.11 71
  158 2.94 29
  167 3.42 34
  168 6.11 61
  169 5.92 59
  170 3 30
  180 3.1 31
  181 2.2 22
  182 5.1 51
  183 3.16 32
  184 2.82 28
  185 2.13 21
  186 3.21 32
  187 1.85 19
  194 2.14 21
  195 3.27 33
  196 1.76 18
  197 3.32 33
  241 3.04 30
  280 2.29 23
  296 2.31 23
  297 2.52 25
  298 20.24 202
  299 5.48 55