ACCESSION: MSBNK-Fac_Eng_Univ_Tokyo-JP010612
RECORD_TITLE: DIMETHYLPROPYLSILANE; EI-B; MS
DATE: 2016.01.19 (Created 2008.10.21, modified 2011.05.06)
AUTHORS: YAMAMOTO M, DEP. CHEMISTRY, FAC. SCIENCE, NARA WOMEN'S UNIV.
LICENSE: CC BY-NC-SA

CH$NAME: DIMETHYLPROPYLSILANE
CH$COMPOUND_CLASS: N/A
CH$FORMULA: C5H14Si
CH$EXACT_MASS: 102.08648
CH$SMILES: CCC[SiH](C)C
CH$IUPAC: InChI=1S/C5H14Si/c1-4-5-6(2)3/h6H,4-5H2,1-3H3
CH$LINK: INCHIKEY AOJUJJFLGKIMAZ-UHFFFAOYSA-N

AC$INSTRUMENT: HITACHI RMU-6M
AC$INSTRUMENT_TYPE: EI-B
AC$MASS_SPECTROMETRY: MS_TYPE MS
AC$MASS_SPECTROMETRY: ION_MODE POSITIVE
AC$MASS_SPECTROMETRY: IONIZATION_ENERGY 70 eV

MS$FOCUSED_ION: ION_TYPE [M]+*

PK$SPLASH: splash10-0a4i-9000000000-5b6f027520e66121b197
PK$NUM_PEAK: 29
PK$PEAK: m/z int. rel.int.
  15 1 10
  27 3.5 35
  28 2 20
  29 0.44 4
  31 6.6 66
  39 2.6 26
  41 2 20
  42 0.34 3
  43 18 180
  44 3.3 33
  45 15.7 157
  46 0.1 1
  53 1.9 19
  55 2.3 23
  57 2 20
  58 3.2 32
  59 99.99 999
  60 8.4 84
  61 3.3 33
  71 0.14 1
  72 1.2 12
  73 2.9 29
  85 1.2 12
  86 0.18 2
  87 9.9 99
  88 1.2 12
  100 3.4 34
  101 0.74 7
  102 4.6 46