ACCESSION: MSBNK-Fac_Eng_Univ_Tokyo-JP010531
RECORD_TITLE: BENZIL; EI-B; MS
DATE: 2016.01.19 (Created 2008.10.21, modified 2011.05.06)
AUTHORS: NARA WOMEN'S UNIVERSITY
LICENSE: CC BY-NC-SA

CH$NAME: BENZIL
CH$COMPOUND_CLASS: N/A
CH$FORMULA: C14H10O2
CH$EXACT_MASS: 210.06808
CH$SMILES: c(c2)ccc(c2)C(=O)C(=O)c(c1)cccc1
CH$IUPAC: InChI=1S/C14H10O2/c15-13(11-7-3-1-4-8-11)14(16)12-9-5-2-6-10-12/h1-10H
CH$LINK: CAS 134-81-6
CH$LINK: INCHIKEY WURBFLDFSFBTLW-UHFFFAOYSA-N
CH$LINK: COMPTOX DTXSID3044380

AC$INSTRUMENT: HITACHI M-80
AC$INSTRUMENT_TYPE: EI-B
AC$MASS_SPECTROMETRY: MS_TYPE MS
AC$MASS_SPECTROMETRY: ION_MODE POSITIVE
AC$MASS_SPECTROMETRY: IONIZATION_ENERGY 20 eV

MS$FOCUSED_ION: ION_TYPE [M]+*

PK$SPLASH: splash10-0a4i-2900000000-2e88c8f905656f6a1c15
PK$NUM_PEAK: 6
PK$PEAK: m/z int. rel.int.
  51 1.1 11
  77 21.84 218
  78 2.23 22
  105 99.99 999
  106 7.67 77
  210 4.21 42