ACCESSION: MSBNK-Fac_Eng_Univ_Tokyo-JP010484
RECORD_TITLE: N,N-DIMETHYLBENZYLAMINE; EI-B; MS
DATE: 2016.01.19 (Created 2008.10.21, modified 2011.05.06)
AUTHORS: TAJIMA S, GUNMA COLLEGE OF TECHNOLOGY
LICENSE: CC BY-NC-SA

CH$NAME: N,N-DIMETHYLBENZYLAMINE
CH$COMPOUND_CLASS: N/A
CH$FORMULA: C9H13N
CH$EXACT_MASS: 135.10480
CH$SMILES: CN(C)Cc(c1)cccc1
CH$IUPAC: InChI=1S/C9H13N/c1-10(2)8-9-6-4-3-5-7-9/h3-7H,8H2,1-2H3
CH$LINK: INCHIKEY XXBDWLFCJWSEKW-UHFFFAOYSA-N
CH$LINK: COMPTOX DTXSID8021854

AC$INSTRUMENT: HITACHI M-80A
AC$INSTRUMENT_TYPE: EI-B
AC$MASS_SPECTROMETRY: MS_TYPE MS
AC$MASS_SPECTROMETRY: ION_MODE POSITIVE
AC$MASS_SPECTROMETRY: IONIZATION_ENERGY 70 eV

MS$FOCUSED_ION: ION_TYPE [M]+*

PK$SPLASH: splash10-0a4l-9200000000-e842688dfbc478ea001b
PK$NUM_PEAK: 34
PK$PEAK: m/z int. rel.int.
  15 4.47 45
  27 1.85 19
  29 1.33 13
  30 2.78 28
  38 1.52 15
  39 8.38 84
  40 1.38 14
  41 3.78 38
  42 22.65 227
  43 8.09 81
  44 9.58 96
  50 2.89 29
  51 6.81 68
  52 1.76 18
  57 3.66 37
  58 99.99 999
  59 3.84 38
  62 1.65 17
  63 5.49 55
  64 1.61 16
  65 14.16 142
  66 1.16 12
  67 1.01 10
  77 4.01 40
  78 1.58 16
  89 3.73 37
  90 1.66 17
  91 49.12 491
  92 8.65 87
  118 3.21 32
  132 1.58 16
  134 29.27 293
  135 49.2 492
  136 5.31 53