ACCESSION: MSBNK-Fac_Eng_Univ_Tokyo-JP010440
RECORD_TITLE: DIMETHYL SULFATE; EI-B; MS
DATE: 2016.01.19 (Created 2008.10.21, modified 2011.05.06)
AUTHORS: UOEH
LICENSE: CC BY-NC-SA

CH$NAME: DIMETHYL SULFATE
CH$COMPOUND_CLASS: N/A
CH$FORMULA: C2H6O4S
CH$EXACT_MASS: 125.99868
CH$SMILES: N/A
CH$IUPAC: N/A

AC$INSTRUMENT: JEOL JMS-DX-303
AC$INSTRUMENT_TYPE: EI-B
AC$MASS_SPECTROMETRY: MS_TYPE MS
AC$MASS_SPECTROMETRY: ION_MODE POSITIVE
AC$MASS_SPECTROMETRY: IONIZATION_ENERGY 70 eV

MS$FOCUSED_ION: ION_TYPE [M]+*

PK$SPLASH: splash10-0002-9000000000-ba54a7df9ce141fdb446
PK$NUM_PEAK: 18
PK$PEAK: m/z int. rel.int.
  45 23.49 235
  48 3.97 40
  50 1.73 17
  61 1.3 13
  64 2.64 26
  65 8.17 82
  66 22.15 222
  68 1.16 12
  78 4.33 43
  79 10.18 102
  81 1.46 15
  95 99.99 999
  96 54.06 541
  97 8 80
  98 3.02 30
  125 9.14 91
  126 7.31 73
  127 1.04 10