ACCESSION: MSBNK-Fac_Eng_Univ_Tokyo-JP010268
RECORD_TITLE: DI-TERT-BUTYL 2-PHENYL-1-PYRROLINE-TRANS-3,4-DICARBOXYLATE; EI-B; MS
DATE: 2016.01.19 (Created 2008.10.21, modified 2011.05.06)
AUTHORS: KANEMASA S, INST. OF ADVANCED MATERIAL STUDY KYUSHU UNIV.
LICENSE: CC BY-NC-SA

CH$NAME: DI-TERT-BUTYL 2-PHENYL-1-PYRROLINE-TRANS-3,4-DICARBOXYLATE
CH$NAME: DI-TERT-BUTYL (3S,4S)-2-PHENYL-1-PYRROLINE-3,4-DICARBOXYLATE
CH$COMPOUND_CLASS: N/A
CH$FORMULA: C20H27NO4
CH$EXACT_MASS: 345.19401
CH$SMILES: CC(C)(C)OC(=O)C([H])(C2)C([H])(C(=O)OC(C)(C)C)C(=N2)c(c1)cccc1
CH$IUPAC: InChI=1S/C20H27NO4/c1-19(2,3)24-17(22)14-12-21-16(13-10-8-7-9-11-13)15(14)18(23)25-20(4,5)6/h7-11,14-15H,12H2,1-6H3/t14-,15-/m0/s1
CH$LINK: INCHIKEY SVKDBPLUPBTIRO-GJZGRUSLSA-N

AC$INSTRUMENT: JEOL JMS-01-SG-2
AC$INSTRUMENT_TYPE: EI-B
AC$MASS_SPECTROMETRY: MS_TYPE MS
AC$MASS_SPECTROMETRY: ION_MODE POSITIVE
AC$MASS_SPECTROMETRY: IONIZATION_ENERGY 75 eV

MS$FOCUSED_ION: ION_TYPE [M]+*

PK$SPLASH: splash10-0apv-7974000000-371a00bf1bd9647d5c71
PK$NUM_PEAK: 34
PK$PEAK: m/z int. rel.int.
  39 5.9 59
  41 19.75 198
  43 2.86 29
  56 3.06 31
  57 99.99 999
  58 4.65 47
  68 4.04 40
  77 4.09 41
  85 11.42 114
  86 2.74 27
  104 7.63 76
  113 5.91 59
  115 11.02 110
  116 4.69 47
  117 20.14 201
  142 3.45 35
  143 15.15 152
  144 33.42 334
  145 3.78 38
  170 8.05 81
  187 21.11 211
  188 51.46 515
  189 15.16 152
  215 8.65 87
  216 31.07 311
  217 4.07 41
  233 67.59 676
  234 16.79 168
  272 11.33 113
  289 20.54 205
  290 11.18 112
  346 70.23 702
  347 16.61 166
  348 2.7 27