ACCESSION: MSBNK-Fac_Eng_Univ_Tokyo-JP010111
RECORD_TITLE: SEBACOYL DIMETHYL ESTER; EI-B; MS
DATE: 2016.01.19 (Created 2008.10.21, modified 2011.05.06)
AUTHORS: KURARAY CO., LTD.
LICENSE: CC BY-NC-SA

CH$NAME: SEBACOYL DIMETHYL ESTER
CH$NAME: DECANE-1,10-DICARBOXYLIC ACID DIMETHYL ESTER
CH$COMPOUND_CLASS: N/A
CH$FORMULA: C12H22O4
CH$EXACT_MASS: 230.15181
CH$SMILES: N/A
CH$IUPAC: N/A

AC$INSTRUMENT: JEOL JMS-D-300
AC$INSTRUMENT_TYPE: EI-B
AC$MASS_SPECTROMETRY: MS_TYPE MS
AC$MASS_SPECTROMETRY: ION_MODE POSITIVE
AC$MASS_SPECTROMETRY: IONIZATION_ENERGY 70 eV

MS$FOCUSED_ION: ION_TYPE [M]+*

PK$SPLASH: splash10-0595-9500000000-d42bda4d3fb8207cccec
PK$NUM_PEAK: 78
PK$PEAK: m/z int. rel.int.
  41 41.5 415
  42 11.3 113
  43 48.1 481
  44 0.28 3
  45 5.7 57
  53 4.2 42
  54 4.2 42
  55 9.43 94
  56 10.4 104
  57 8.5 85
  59 41.5 415
  67 1.04 10
  68 6.6 66
  69 37.7 377
  70 7.6 76
  71 0.47 5
  73 9.4 94
  74 99.99 999
  75 5.7 57
  79 0.57 6
  80 5.7 57
  81 12.3 123
  82 5.7 57
  83 4.15 42
  84 55.7 557
  85 4.7 47
  87 35.9 359
  88 0.4 4
  93 3.8 38
  94 4.7 47
  95 9.4 94
  96 1.23 12
  97 51.9 519
  98 61.3 613
  99 5.9 59
  100 0.09 1
  101 10.4 104
  102 0.9 9
  106 0.9 9
  107 0.57 6
  109 2.8 28
  110 7.7 77
  111 11.3 113
  112 0.76 8
  113 2.8 28
  114 2.8 28
  115 10.8 108
  116 0.09 1
  120 2.8 28
  121 11.3 113
  122 1.9 19
  123 0.47 5
  124 9.1 91
  125 76.4 764
  126 4.7 47
  128 0.09 1
  129 0.9 9
  137 2.8 28
  138 40.6 406
  139 2.08 21
  140 1.9 19
  141 0.9 9
  142 0.9 9
  143 0.19 2
  144 4.7 47
  148 5.7 57
  149 2.8 28
  154 0.09 1
  155 0.9 9
  156 0.9 9
  157 46.2 462
  158 0.43 4
  166 33 330
  167 5.9 59
  170 4.7 47
  198 0.38 4
  199 54.7 547
  200 6.6 66