ACCESSION: MSBNK-Fac_Eng_Univ_Tokyo-JP010064
RECORD_TITLE: DIOCTYL ADIPATE; EI-B; MS
DATE: 2016.01.19 (Created 2008.10.21, modified 2011.05.06)
AUTHORS: KURARAY CO., LTD.
LICENSE: CC BY-NC-SA

CH$NAME: DIOCTYL ADIPATE
CH$NAME: ADIPIC ACID DIOCTHLESTER
CH$COMPOUND_CLASS: N/A
CH$FORMULA: C22H42O4
CH$EXACT_MASS: 370.30831
CH$SMILES: CCCCCCCCOC(=O)CCCCC(=O)OCCCCCCCC
CH$IUPAC: InChI=1S/C22H42O4/c1-3-5-7-9-11-15-19-25-21(23)17-13-14-18-22(24)26-20-16-12-10-8-6-4-2/h3-20H2,1-2H3
CH$LINK: INCHIKEY NEHDRDVHPTWWFG-UHFFFAOYSA-N
CH$LINK: COMPTOX DTXSID2021606

AC$INSTRUMENT: JEOL JMS-D-300
AC$INSTRUMENT_TYPE: EI-B
AC$MASS_SPECTROMETRY: MS_TYPE MS
AC$MASS_SPECTROMETRY: ION_MODE POSITIVE
AC$MASS_SPECTROMETRY: IONIZATION_ENERGY 70 eV

MS$FOCUSED_ION: ION_TYPE [M]+*

PK$SPLASH: splash10-00b9-7900000000-92f135b67c9cebe254e4
PK$NUM_PEAK: 54
PK$PEAK: m/z int. rel.int.
  27 1.4 14
  28 51 510
  29 5 50
  32 2.01 20
  39 1.9 19
  41 15 150
  42 1.9 19
  43 1.78 18
  53 2.1 21
  55 19.9 199
  56 8.7 87
  57 3.9 39
  58 2.1 21
  59 3.8 38
  68 2.5 25
  69 0.67 7
  70 31.5 315
  71 30 300
  82 2.9 29
  83 1.4 14
  84 8.6 86
  87 7.5 75
  96 1.4 14
  97 0.32 3
  100 6.9 69
  101 7.5 75
  102 5.2 52
  111 1.01 10
  112 30.4 304
  113 14 140
  121 18.2 182
  127 0.13 1
  128 6.2 62
  129 99.99 999
  130 10.4 104
  135 0.32 3
  136 2 20
  139 5.2 52
  141 1.7 17
  142 0.57 6
  146 5.2 52
  147 14.5 145
  148 4.5 45
  150 0.13 1
  151 2.8 28
  173 4.1 41
  175 1.6 16
  178 0.44 4
  179 2 20
  195 2.2 22
  207 1.5 15
  241 0.81 8
  259 4.5 45
  270 3.1 31