ACCESSION: MSBNK-Fac_Eng_Univ_Tokyo-JP009894
RECORD_TITLE: DIMETHYL NONANEDIOATE; EI-B; MS
DATE: 2016.01.19 (Created 2008.10.21, modified 2011.05.06)
AUTHORS: KURARAY CO., LTD.
LICENSE: CC BY-NC-SA

CH$NAME: DIMETHYL NONANEDIOATE
CH$COMPOUND_CLASS: N/A
CH$FORMULA: C11H20O4
CH$EXACT_MASS: 216.13616
CH$SMILES: COC(=O)CCCCCCCC(=O)OC
CH$IUPAC: InChI=1S/C11H20O4/c1-14-10(12)8-6-4-3-5-7-9-11(13)15-2/h3-9H2,1-2H3
CH$LINK: CAS 1732-10-1
CH$LINK: INCHIKEY DRUKNYVQGHETPO-UHFFFAOYSA-N
CH$LINK: COMPTOX DTXSID1044807

AC$INSTRUMENT: JEOL JMS-D-300
AC$INSTRUMENT_TYPE: EI-B
AC$MASS_SPECTROMETRY: MS_TYPE MS
AC$MASS_SPECTROMETRY: ION_MODE POSITIVE
AC$MASS_SPECTROMETRY: IONIZATION_ENERGY 70 eV

MS$FOCUSED_ION: ION_TYPE [M]+*

PK$SPLASH: splash10-0piu-9200000000-2d1b67f9c876d877c4a4
PK$NUM_PEAK: 64
PK$PEAK: m/z int. rel.int.
  27 8.8 88
  28 17.2 172
  29 13.8 138
  30 2 20
  31 3.5 35
  32 8.6 86
  33 1 10
  39 11 110
  41 39.8 398
  42 12.3 123
  43 46.1 461
  44 4 40
  45 7.6 76
  49 1.1 11
  53 4.5 45
  54 4.6 46
  55 91.6 916
  56 6.8 68
  57 7.6 76
  58 1.7 17
  59 49 490
  60 2 20
  63 5.9 59
  65 1.3 13
  67 10.2 102
  68 8.7 87
  69 41 410
  70 4 40
  71 6.6 66
  72 2 20
  73 9.5 95
  74 96.5 965
  75 5.8 58
  77 2.7 27
  79 4.7 47
  80 4.8 48
  81 10.8 108
  82 12 120
  83 72 720
  84 36.8 368
  85 4 40
  87 35.5 355
  88 4.9 49
  89 1.3 13
  91 1.2 12
  92 1.4 14
  93 3.2 32
  94 1.5 15
  95 5 50
  96 12.8 128
  97 31.8 318
  98 21 210
  99 4.1 41
  100 1.5 15
  151 1.7 17
  152 99.99 999
  153 14.3 143
  154 1 10
  156 7 70
  157 2.2 22
  184 4.5 45
  185 58.4 584
  186 8.2 82
  187 1.2 12