ACCESSION: MSBNK-Fac_Eng_Univ_Tokyo-JP009372
RECORD_TITLE: DIBENZO(C,H)BICYCLO(4.4.1)UNDECA-3,8-DIEN-11-ONE TRIMETHYLENE ACETAL; EI-B; MS
DATE: 2016.01.19 (Created 2008.10.21, modified 2011.05.06)
AUTHORS: TASHIRO M, INST. OF ADVANCED MATERIAL STUDY KYUSHU UNIV.
LICENSE: CC BY-NC-SA

CH$NAME: DIBENZO(C,H)BICYCLO(4.4.1)UNDECA-3,8-DIEN-11-ONE TRIMETHYLENE ACETAL
CH$COMPOUND_CLASS: N/A
CH$FORMULA: C22H24O2
CH$EXACT_MASS: 320.17763
CH$SMILES: N/A
CH$IUPAC: N/A

AC$INSTRUMENT: JEOL JMS-01-SG-2
AC$INSTRUMENT_TYPE: EI-B
AC$MASS_SPECTROMETRY: MS_TYPE MS
AC$MASS_SPECTROMETRY: ION_MODE POSITIVE
AC$MASS_SPECTROMETRY: IONIZATION_ENERGY 75 eV

MS$FOCUSED_ION: ION_TYPE [M]+*

PK$SPLASH: splash10-00mo-6910000000-0d1fac0e6897fbe2fb1e
PK$NUM_PEAK: 60
PK$PEAK: m/z int. rel.int.
  38 16.91 169
  39 8.53 85
  40 28.16 282
  41 9.2 92
  42 99.99 999
  51 8.02 80
  52 7.11 71
  55 10.3 103
  57 7.88 79
  58 9.74 97
  65 10.01 100
  67 16.27 163
  77 15.47 155
  78 22.8 228
  79 10.03 100
  80 9.78 98
  89 6.92 69
  91 35.39 354
  102 7.88 79
  103 19.5 195
  104 33.02 330
  105 36.36 364
  110 11.93 119
  115 58.49 585
  116 27.65 277
  117 46.55 466
  118 10.52 105
  127 12.5 125
  128 37.9 379
  129 55.25 553
  130 14.01 140
  131 7.03 70
  132 2.13 21
  141 5.29 53
  142 2.75 28
  143 2.33 23
  144 2.37 24
  145 3.6 36
  157 19.92 199
  158 4.54 45
  165 2.12 21
  171 2.58 26
  178 1.98 20
  190 2.77 28
  191 2.77 28
  197 2.46 25
  201 4.7 47
  202 4.43 44
  203 3.47 35
  205 3.13 31
  215 45.91 459
  216 9.12 91
  217 2.1 21
  220 2.13 21
  229 3.65 37
  244 3.16 32
  262 7.93 79
  263 1.98 20
  320 17.58 176
  321 4.97 50