ACCESSION: MSBNK-Fac_Eng_Univ_Tokyo-JP009135
RECORD_TITLE: DIMETHYL DISULFIDE; EI-B; MS
DATE: 2016.01.19 (Created 2008.10.21, modified 2011.05.06)
AUTHORS: SODA AROMATIC CO., LTD.
LICENSE: CC BY-NC-SA

CH$NAME: DIMETHYL DISULFIDE
CH$COMPOUND_CLASS: N/A
CH$FORMULA: C2H6S2
CH$EXACT_MASS: 93.99109
CH$SMILES: CSSC
CH$IUPAC: InChI=1S/C2H6S2/c1-3-4-2/h1-2H3
CH$LINK: INCHIKEY WQOXQRCZOLPYPM-UHFFFAOYSA-N
CH$LINK: COMPTOX DTXSID4025117

AC$INSTRUMENT: HITACHI M-80B
AC$INSTRUMENT_TYPE: EI-B
AC$MASS_SPECTROMETRY: MS_TYPE MS
AC$MASS_SPECTROMETRY: ION_MODE POSITIVE
AC$MASS_SPECTROMETRY: IONIZATION_ENERGY 70 eV

MS$FOCUSED_ION: ION_TYPE [M]+*

PK$SPLASH: splash10-0005-9000000000-61860690131d526ccbcd
PK$NUM_PEAK: 19
PK$PEAK: m/z int. rel.int.
  14 2.59 26
  15 9.27 93
  32 2.97 30
  44 3.75 38
  45 67.08 671
  46 35.01 350
  47 24.03 240
  48 11.29 113
  49 3.7 37
  61 14.06 141
  64 12.77 128
  66 1.13 11
  78 3.01 30
  79 58.38 584
  80 1.74 17
  81 5.16 52
  94 99.99 999
  95 4.02 40
  96 9.42 94