ACCESSION: MSBNK-Fac_Eng_Univ_Tokyo-JP008968
RECORD_TITLE: DIPHENYL ETHER; EI-B; MS
DATE: 2016.01.19 (Created 2008.10.21, modified 2011.05.06)
AUTHORS: YAMAMOTO M, DEP. CHEMISTRY, FAC. SCIENCE, NARA WOMEN'S UNIV.
LICENSE: CC BY-NC-SA

CH$NAME: DIPHENYL ETHER
CH$COMPOUND_CLASS: N/A
CH$FORMULA: C12H10O
CH$EXACT_MASS: 170.07316
CH$SMILES: c(c2)ccc(c2)Oc(c1)cccc1
CH$IUPAC: InChI=1S/C12H10O/c1-3-7-11(8-4-1)13-12-9-5-2-6-10-12/h1-10H
CH$LINK: INCHIKEY USIUVYZYUHIAEV-UHFFFAOYSA-N
CH$LINK: COMPTOX DTXSID9021847

AC$INSTRUMENT: HITACHI RMU-6M
AC$INSTRUMENT_TYPE: EI-B
AC$MASS_SPECTROMETRY: MS_TYPE MS
AC$MASS_SPECTROMETRY: ION_MODE POSITIVE
AC$MASS_SPECTROMETRY: IONIZATION_ENERGY 20 eV

MS$FOCUSED_ION: ION_TYPE [M]+*

PK$SPLASH: splash10-00dl-2900000000-20b598592da4acb1c557
PK$NUM_PEAK: 20
PK$PEAK: m/z int. rel.int.
  51 6.7 67
  65 3.4 34
  77 27.6 276
  78 0.2 2
  79 1 10
  91 3 30
  92 6.1 61
  94 0.35 4
  107 1 10
  115 6.4 64
  116 1.7 17
  140 0.13 1
  141 32.8 328
  142 26.6 266
  143 2.9 29
  168 0.17 2
  169 12.3 123
  170 99.99 999
  171 12.9 129
  172 1.2 12