ACCESSION: MSBNK-Fac_Eng_Univ_Tokyo-JP007213
RECORD_TITLE: DECYL METHYL ETHER; EI-B; MS
DATE: 2016.01.19 (Created 2008.10.21, modified 2011.05.06)
AUTHORS: SODA AROMATIC CO., LTD.
LICENSE: CC BY-NC-SA

CH$NAME: DECYL METHYL ETHER
CH$COMPOUND_CLASS: N/A
CH$FORMULA: C11H24O
CH$EXACT_MASS: 172.18272
CH$SMILES: CCCCCCCCCCOC
CH$IUPAC: InChI=1S/C11H24O/c1-3-4-5-6-7-8-9-10-11-12-2/h3-11H2,1-2H3
CH$LINK: COMPTOX DTXSID6064616
CH$LINK: INCHIKEY JPEWDCTZJFUITH-UHFFFAOYSA-N
CH$LINK: PUBCHEM CID:23716

AC$INSTRUMENT: HITACHI M-80B
AC$INSTRUMENT_TYPE: EI-B
AC$MASS_SPECTROMETRY: MS_TYPE MS
AC$MASS_SPECTROMETRY: ION_MODE POSITIVE
AC$MASS_SPECTROMETRY: IONIZATION_ENERGY 70 eV

MS$FOCUSED_ION: ION_TYPE [M]+*

PK$SPLASH: splash10-052e-9000000000-d5adfb0aa2ce7aba039b
PK$NUM_PEAK: 33
PK$PEAK: m/z int. rel.int.
  15 1.53 15
  27 8.26 83
  28 1.58 16
  29 15 150
  33 1.28 13
  39 6.82 68
  41 29.89 299
  42 13.32 133
  43 25.75 258
  45 99.99 999
  46 1.79 18
  53 1.75 18
  54 2.53 25
  55 28.78 288
  56 29.46 295
  57 13.02 130
  58 1.57 16
  67 2.52 25
  68 13.03 130
  69 24.8 248
  70 33.84 338
  71 7.01 70
  82 11.58 116
  83 27.2 272
  84 18.07 181
  85 2.68 27
  96 1.7 17
  97 12.33 123
  98 5.78 58
  111 5.97 60
  112 12.09 121
  140 11.04 110
  141 1.05 11