ACCESSION: MSBNK-Fac_Eng_Univ_Tokyo-JP006365
RECORD_TITLE: 1,1'-BINAPHTHYL-2,2'-BISACRYLATE; EI-B; MS
DATE: 2016.01.19 (Created 2008.10.21, modified 2011.05.06)
AUTHORS: HISAHIRO HAGIWARA, CHEMICAL RESEARCH INSTITUTE OF NON-AQUEOUSSOLUTIONS TOHOKU UNIV.
LICENSE: CC BY-NC-SA

CH$NAME: 1,1'-BINAPHTHYL-2,2'-BISACRYLATE
CH$COMPOUND_CLASS: N/A
CH$FORMULA: C26H18O4
CH$EXACT_MASS: 394.12051
CH$SMILES: c(c12)cccc(ccc(c2c(c4C=CC(O)=O)c(c3)c(cc4)ccc3)C=CC(O)=O)1
CH$IUPAC: InChI=1S/C26H18O4/c27-23(28)15-13-19-11-9-17-5-1-3-7-21(17)25(19)26-20(14-16-24(29)30)12-10-18-6-2-4-8-22(18)26/h1-16H,(H,27,28)(H,29,30)/b15-13+,16-14+
CH$LINK: INCHIKEY WDKPJHDWIXCUKA-WXUKJITCSA-N

AC$INSTRUMENT: JEOL JMS-DX-300
AC$INSTRUMENT_TYPE: EI-B
AC$MASS_SPECTROMETRY: MS_TYPE MS
AC$MASS_SPECTROMETRY: ION_MODE POSITIVE
AC$MASS_SPECTROMETRY: IONIZATION_ENERGY 70 eV

MS$FOCUSED_ION: ION_TYPE [M]+*

PK$SPLASH: splash10-052o-3096000000-d81b94b56b75d0364d16
PK$NUM_PEAK: 45
PK$PEAK: m/z int. rel.int.
  55 77.42 774
  56 2.39 24
  105 1.78 18
  115 1.98 20
  120 1.13 11
  130 1.08 11
  170 1.03 10
  186 1.12 11
  200 1.33 13
  202 1.49 15
  224 2.26 23
  225 1.79 18
  226 9.05 91
  227 4 40
  228 5.38 54
  229 3.22 32
  230 1.17 12
  232 1.06 11
  235 1.19 12
  237 1.97 20
  239 8.12 81
  240 3.38 34
  241 2.16 22
  255 6.33 63
  256 1.36 14
  257 4.63 46
  258 2.8 28
  264 1.07 11
  266 1.72 17
  267 3.15 32
  268 11.53 115
  269 5.69 57
  282 2.64 26
  283 1.08 11
  285 4.72 47
  286 99.99 999
  287 25.51 255
  288 2.85 29
  323 1.16 12
  340 68.77 688
  341 18.07 181
  342 3.35 34
  394 45.45 455
  395 13.27 133
  396 2.26 23