ACCESSION: MSBNK-Fac_Eng_Univ_Tokyo-JP006085
RECORD_TITLE: DIMETHYL MALONATE; CI-B; MS
DATE: 2016.01.19 (Created 2008.10.21, modified 2011.05.06)
AUTHORS: HASHIMOTO K, KYOTO COLLEGE OF PHARMACY
LICENSE: CC BY-NC-SA

CH$NAME: DIMETHYL MALONATE
CH$COMPOUND_CLASS: N/A
CH$FORMULA: C5H8O4
CH$EXACT_MASS: 132.04226
CH$SMILES: COC(=O)CC(=O)OC
CH$IUPAC: InChI=1S/C5H8O4/c1-8-4(6)3-5(7)9-2/h3H2,1-2H3
CH$LINK: INCHIKEY BEPAFCGSDWSTEL-UHFFFAOYSA-N
CH$LINK: COMPTOX DTXSID4029145

AC$INSTRUMENT: HITACHI M-80
AC$INSTRUMENT_TYPE: CI-B
AC$MASS_SPECTROMETRY: MS_TYPE MS
AC$MASS_SPECTROMETRY: ION_MODE POSITIVE
AC$MASS_SPECTROMETRY: IONIZATION_ENERGY 100 eV
AC$MASS_SPECTROMETRY: REAGENT_GAS ISOBUTANE

PK$SPLASH: splash10-0udi-1900000000-0502fac620c70e52c2d8
PK$NUM_PEAK: 6
PK$PEAK: m/z int. rel.int.
  68 1.09 11
  74 6.18 62
  101 42.89 429
  102 1.74 17
  134 5.78 58
  135 1 10