ACCESSION: MSBNK-Fac_Eng_Univ_Tokyo-JP004846
RECORD_TITLE: (2S*,11R*)-2-(4,8,14,15,15-PENTAMETHYLBICYCLO(9.3.1)PENTADECA-4(E),8(E),14-TRIENE)CARBONITRILE; EI-B; MS
DATE: 2016.01.19 (Created 2008.10.21, modified 2011.05.06)
AUTHORS: KATO T, DEPT. OF CHEM., FAC. OF SCI., TOHOKU UNIV.
LICENSE: CC BY-NC-SA

CH$NAME: (2S*,11R*)-2-(4,8,14,15,15-PENTAMETHYLBICYCLO(9.3.1)PENTADECA-4(E),8(E),14-TRIENE)CARBONITRILE
CH$COMPOUND_CLASS: N/A
CH$FORMULA: C21H32N
CH$EXACT_MASS: 298.25348
CH$SMILES: N/A
CH$IUPAC: N/A

AC$INSTRUMENT: Unknown
AC$INSTRUMENT_TYPE: EI-B
AC$MASS_SPECTROMETRY: MS_TYPE MS
AC$MASS_SPECTROMETRY: ION_MODE POSITIVE
AC$MASS_SPECTROMETRY: IONIZATION_ENERGY 25 eV

MS$FOCUSED_ION: ION_TYPE [M]+*

PK$SPLASH: splash10-05us-3920000000-ac1e8b0e1a2845306716
PK$NUM_PEAK: 68
PK$PEAK: m/z int. rel.int.
  55 10.4 104
  57 11 110
  67 13.7 137
  68 0.78 8
  69 37.4 374
  79 5.5 55
  81 42.8 428
  82 1.6 16
  83 18.7 187
  91 2.7 27
  93 22.5 225
  94 1.54 15
  95 59.8 598
  96 5 50
  97 3.3 33
  105 0.55 6
  106 3 30
  107 67.5 675
  108 13.5 135
  109 8.17 82
  110 10.4 104
  118 5.5 55
  119 36.5 365
  120 1.4 14
  121 42.2 422
  122 11 110
  123 45.4 454
  131 1.21 12
  132 27.8 278
  133 29.6 296
  134 13.1 131
  135 2.88 29
  136 4.1 41
  137 1.1 11
  144 22 220
  145 1.28 13
  146 53.8 538
  147 15.9 159
  148 3.8 38
  158 1.54 15
  159 61.5 615
  160 22 220
  161 23.8 238
  171 0.33 3
  172 10.2 102
  173 10.4 104
  174 2.2 22
  175 1.1 11
  186 7.7 77
  187 2.2 22
  189 4.1 41
  198 0.14 1
  200 1.6 16
  201 1.8 18
  212 1.6 16
  213 0.12 1
  214 13.2 132
  226 1.5 15
  228 1.6 16
  229 0.12 1
  240 1.2 12
  254 9.2 92
  255 1.2 12
  269 0.1 1
  282 99.99 999
  283 16.5 165
  297 14.3 143
  298 1.2 12