ACCESSION: MSBNK-Fac_Eng_Univ_Tokyo-JP004835
RECORD_TITLE: DIPHENYL ETHER; EI-B; MS
DATE: 2016.01.19 (Created 2008.10.21, modified 2011.05.06)
AUTHORS: MASS SPECTROSCOPY SOC. OF JAPAN (MSSJ)
LICENSE: CC BY-NC-SA

CH$NAME: DIPHENYL ETHER
CH$NAME: PHENYL ETHER
CH$COMPOUND_CLASS: N/A
CH$FORMULA: C12H10O
CH$EXACT_MASS: 170.07316
CH$SMILES: c(c2)ccc(c2)Oc(c1)cccc1
CH$IUPAC: InChI=1S/C12H10O/c1-3-7-11(8-4-1)13-12-9-5-2-6-10-12/h1-10H
CH$LINK: CAS 101-84-8
CH$LINK: INCHIKEY USIUVYZYUHIAEV-UHFFFAOYSA-N
CH$LINK: COMPTOX DTXSID9021847

AC$INSTRUMENT: JEOL JMS-D-3000
AC$INSTRUMENT_TYPE: EI-B
AC$MASS_SPECTROMETRY: MS_TYPE MS
AC$MASS_SPECTROMETRY: ION_MODE POSITIVE
AC$MASS_SPECTROMETRY: IONIZATION_ENERGY 70 eV

MS$FOCUSED_ION: ION_TYPE [M]+*

PK$SPLASH: splash10-00di-4900000000-5a461502693f815d0a1c
PK$NUM_PEAK: 28
PK$PEAK: m/z int. rel.int.
  50 5 50
  51 24.09 241
  52 1.35 14
  55 1.18 12
  63 2.99 30
  64 1.34 13
  65 4.06 41
  66 1.21 12
  70 3.37 34
  71 4.53 45
  74 1.33 13
  75 1.41 14
  76 1.77 18
  77 34.07 341
  78 2.49 25
  84 1.11 11
  85 3.47 35
  94 4.93 49
  115 7.65 77
  116 1.43 14
  139 1.85 19
  141 32.36 324
  142 20.33 203
  143 2.36 24
  169 17.92 179
  170 99.99 999
  171 13.53 135
  172 1.12 11