ACCESSION: MSBNK-Fac_Eng_Univ_Tokyo-JP003922
RECORD_TITLE: DI-N-PENTYL ETHER; EI-B; MS
DATE: 2016.01.19 (Created 2008.10.21, modified 2011.05.06)
AUTHORS: MASS SPECTROSCOPY SOC. OF JAPAN (MSSJ)
LICENSE: CC BY-NC-SA

CH$NAME: DI-N-PENTYL ETHER
CH$COMPOUND_CLASS: N/A
CH$FORMULA: C10H22O
CH$EXACT_MASS: 158.16707
CH$SMILES: CCCCCOCCCCC
CH$IUPAC: InChI=1S/C10H22O/c1-3-5-7-9-11-10-8-6-4-2/h3-10H2,1-2H3
CH$LINK: INCHIKEY AOPDRZXCEAKHHW-UHFFFAOYSA-N
CH$LINK: COMPTOX DTXSID4022105

AC$INSTRUMENT: Unknown
AC$INSTRUMENT_TYPE: EI-B
AC$MASS_SPECTROMETRY: MS_TYPE MS
AC$MASS_SPECTROMETRY: ION_MODE POSITIVE

MS$FOCUSED_ION: ION_TYPE [M]+*

PK$SPLASH: splash10-006x-9000000000-1d05adfec6422775cecc
PK$NUM_PEAK: 27
PK$PEAK: m/z int. rel.int.
  26 3.2 32
  27 33.6 336
  28 7.9 79
  29 4.32 43
  30 2.8 28
  31 4.5 45
  39 14.5 145
  40 0.36 4
  41 36.1 361
  42 23.9 239
  43 93.9 939
  44 0.53 5
  45 2.8 28
  53 3.1 31
  55 15 150
  56 0.35 4
  57 3.1 31
  59 3 30
  69 15.8 158
  70 3.89 39
  71 99.99 999
  72 5.6 56
  87 2.2 22
  89 0.4 4
  101 7.1 71
  115 2.8 28
  158 2.9 29