ACCESSION: MSBNK-Fac_Eng_Univ_Tokyo-JP003885
RECORD_TITLE: BENZOPHENONE OXIME; EI-B; MS
DATE: 2016.01.19 (Created 2008.10.21, modified 2011.05.06)
AUTHORS: MASS SPECTROSCOPY SOC. OF JAPAN (MSSJ)
LICENSE: CC BY-NC-SA

CH$NAME: BENZOPHENONE OXIME
CH$COMPOUND_CLASS: N/A
CH$FORMULA: C13H11NO
CH$EXACT_MASS: 197.08406
CH$SMILES: ON=C(c(c2)cccc2)c(c1)cccc1
CH$IUPAC: InChI=1S/C13H11NO/c15-14-13(11-7-3-1-4-8-11)12-9-5-2-6-10-12/h1-10,15H
CH$LINK: INCHIKEY DNYZBFWKVMKMRM-UHFFFAOYSA-N
CH$LINK: COMPTOX DTXSID0060355

AC$INSTRUMENT: Unknown
AC$INSTRUMENT_TYPE: EI-B
AC$MASS_SPECTROMETRY: MS_TYPE MS
AC$MASS_SPECTROMETRY: ION_MODE POSITIVE

MS$FOCUSED_ION: ION_TYPE [M]+*

PK$SPLASH: splash10-0fai-5900000000-c9db4c1ef8a115583f63
PK$NUM_PEAK: 36
PK$PEAK: m/z int. rel.int.
  17 2.1 21
  18 12.4 124
  27 2.4 24
  28 0.76 8
  39 3.5 35
  50 7.4 74
  51 25.6 256
  52 0.5 5
  65 3.5 35
  74 2.9 29
  75 4.4 44
  76 0.97 10
  77 54.4 544
  78 16.2 162
  94 6.2 62
  103 0.59 6
  104 35 350
  105 7.6 76
  119 4.4 44
  151 0.18 2
  152 6.8 68
  153 2.4 24
  163 2.4 24
  164 0.24 2
  165 13.8 138
  166 4.1 41
  167 4.5 45
  168 0.65 7
  169 2.4 24
  179 5.3 53
  180 99.99 999
  181 3.32 33
  182 7.4 74
  196 7.6 76
  197 33.8 338
  198 6.5 65