ACCESSION: MSBNK-Fac_Eng_Univ_Tokyo-JP003724
RECORD_TITLE: VIRIDIN; EI-B; MS
DATE: 2016.01.19 (Created 2008.10.21, modified 2011.05.06)
AUTHORS: SASAKI S, TOYOHASHI UNIV. OF TECH.
LICENSE: CC BY-NC-SA

CH$NAME: VIRIDIN
CH$COMPOUND_CLASS: N/A
CH$FORMULA: C20H16O6
CH$EXACT_MASS: 352.09469
CH$SMILES: N/A
CH$IUPAC: N/A

AC$INSTRUMENT: Unknown
AC$INSTRUMENT_TYPE: EI-B
AC$MASS_SPECTROMETRY: MS_TYPE MS
AC$MASS_SPECTROMETRY: ION_MODE POSITIVE

MS$FOCUSED_ION: ION_TYPE [M]+*

PK$SPLASH: splash10-0fb9-1291000000-47f0b635f8940b86baaa
PK$NUM_PEAK: 58
PK$PEAK: m/z int. rel.int.
  39 1.4 14
  43 2.4 24
  44 1.4 14
  45 0.48 5
  51 2.4 24
  55 0.7 7
  59 1.4 14
  63 0.31 3
  74 3.3 33
  75 2.9 29
  76 2.4 24
  77 0.14 1
  82 2.4 24
  87 1.4 14
  88 2 20
  89 0.14 1
  115 2.4 24
  125 2.4 24
  139 5.7 57
  150 0.24 2
  151 5.5 55
  152 3.8 38
  163 4.8 48
  164 0.29 3
  165 14.8 148
  166 2.9 29
  176 3.5 35
  177 0.09 1
  178 1.4 14
  179 1.4 14
  192 1.4 14
  193 0.71 7
  194 5.5 55
  195 1.4 14
  221 5.7 57
  222 1.71 17
  223 3.8 38
  235 1.4 14
  236 1 10
  237 0.01 0
  249 4.8 48
  250 52.4 524
  251 12.4 124
  252 0.38 4
  263 2.4 24
  277 3.8 38
  278 99.99 999
  279 2.62 26
  280 4.3 43
  305 2.4 24
  309 2.1 21
  319 0.12 1
  323 1.4 14
  324 2.9 29
  337 4.8 48
  338 0.01 0
  352 18.6 186
  353 3.8 38