ACCESSION: MSBNK-Fac_Eng_Univ_Tokyo-JP003533
RECORD_TITLE: BENZOPHENONE; EI-B; MS
DATE: 2016.01.19 (Created 2008.10.21, modified 2011.05.06)
AUTHORS: YAMAMOTO M, DEP. CHEMISTRY, FAC. SCIENCE, NARA WOMEN'S UNIV.
LICENSE: CC BY-NC-SA

CH$NAME: BENZOPHENONE
CH$COMPOUND_CLASS: N/A
CH$FORMULA: C13H10O
CH$EXACT_MASS: 182.07316
CH$SMILES: c(c2)ccc(c2)C(=O)c(c1)cccc1
CH$IUPAC: InChI=1S/C13H10O/c14-13(11-7-3-1-4-8-11)12-9-5-2-6-10-12/h1-10H
CH$LINK: INCHIKEY RWCCWEUUXYIKHB-UHFFFAOYSA-N
CH$LINK: COMPTOX DTXSID0021961

AC$INSTRUMENT: HITACHI RMU-6E
AC$INSTRUMENT_TYPE: EI-B
AC$MASS_SPECTROMETRY: MS_TYPE MS
AC$MASS_SPECTROMETRY: ION_MODE POSITIVE
AC$MASS_SPECTROMETRY: IONIZATION_ENERGY 70 eV

MS$FOCUSED_ION: ION_TYPE [M]+*

PK$SPLASH: splash10-0a4i-3900000000-23d78741cacbe9443a57
PK$NUM_PEAK: 17
PK$PEAK: m/z int. rel.int.
  17 1 10
  18 4 40
  50 4.5 45
  51 17.5 175
  74 1.6 16
  75 1.5 15
  76 4.1 41
  77 5.4 54
  78 3.2 32
  105 99.99 999
  106 7.7 77
  152 0.23 2
  153 1.5 15
  154 1.5 15
  181 5.6 56
  182 4.6 46
  183 6.4 64