ACCESSION: MSBNK-Fac_Eng_Univ_Tokyo-JP003077
RECORD_TITLE: DOXYLAMINE; EI-B; MS
DATE: 2016.01.19 (Created 2008.10.21, modified 2011.05.06)
AUTHORS: SASAKI S, TOYOHASHI UNIV. OF TECH.
LICENSE: CC BY-NC-SA

CH$NAME: DOXYLAMINE
CH$COMPOUND_CLASS: N/A
CH$FORMULA: C17H22N2O
CH$EXACT_MASS: 270.17321
CH$SMILES: N/A
CH$IUPAC: N/A

AC$INSTRUMENT: Unknown
AC$INSTRUMENT_TYPE: EI-B
AC$MASS_SPECTROMETRY: MS_TYPE MS
AC$MASS_SPECTROMETRY: ION_MODE POSITIVE

MS$FOCUSED_ION: ION_TYPE [M]+*

PK$SPLASH: splash10-0a4i-9100000000-91ccde33bed0977e61bd
PK$NUM_PEAK: 69
PK$PEAK: m/z int. rel.int.
  39 1.9 19
  40 0.4 4
  41 1.9 19
  42 0.49 5
  43 2.9 29
  44 3.9 39
  45 3.9 39
  46 0.04 0
  50 0.9 9
  51 1.9 19
  52 0.9 9
  53 0.04 0
  54 0.4 4
  55 0.9 9
  56 3.4 34
  57 0.39 4
  58 99.99 999
  59 3.9 39
  60 0.4 4
  70 0.14 1
  71 49.9 499
  72 5.9 59
  73 9.9 99
  74 0.09 1
  75 0.9 9
  76 0.9 9
  77 2.9 29
  78 0.29 3
  79 1.9 19
  80 0.4 4
  85 0.9 9
  86 0.09 1
  87 0.4 4
  88 2.4 24
  89 0.9 9
  90 0.14 1
  91 1.4 14
  92 0.4 4
  103 0.4 4
  104 0.04 0
  105 0.9 9
  106 1.4 14
  107 0.4 4
  139 0.04 0
  140 0.9 9
  141 0.4 4
  151 0.4 4
  152 0.24 2
  153 0.9 9
  154 0.4 4
  164 0.9 9
  165 0.39 4
  166 2.4 24
  167 9.9 99
  168 2.9 29
  169 0.04 0
  177 0.4 4
  178 0.9 9
  179 0.9 9
  180 1.29 13
  181 5.4 54
  182 6.4 64
  183 3.9 39
  184 0.14 1
  185 0.4 4
  208 0.9 9
  209 0.4 4
  210 0.14 1
  211 0.4 4