ACCESSION: MSBNK-Fac_Eng_Univ_Tokyo-JP002476
RECORD_TITLE: BENZYLTRIMETHYLSILANE; EI-B; MS
DATE: 2016.01.19 (Created 2008.10.21, modified 2011.05.06)
AUTHORS: MASS SPECTROSCOPY SOC. OF JAPAN (MSSJ)
LICENSE: CC BY-NC-SA

CH$NAME: BENZYLTRIMETHYLSILANE
CH$COMPOUND_CLASS: N/A
CH$FORMULA: C10H16Si
CH$EXACT_MASS: 164.10213
CH$SMILES: c(c1)ccc(c1)C[Si](C)(C)C
CH$IUPAC: InChI=1S/C10H16Si/c1-11(2,3)9-10-7-5-4-6-8-10/h4-8H,9H2,1-3H3
CH$LINK: INCHIKEY MRIWRLGWLMRJIW-UHFFFAOYSA-N
CH$LINK: COMPTOX DTXSID5061116

AC$INSTRUMENT: JEOL JMS-D-3000
AC$INSTRUMENT_TYPE: EI-B
AC$MASS_SPECTROMETRY: MS_TYPE MS
AC$MASS_SPECTROMETRY: ION_MODE POSITIVE
AC$MASS_SPECTROMETRY: IONIZATION_ENERGY 70 eV

MS$FOCUSED_ION: ION_TYPE [M]+*

PK$SPLASH: splash10-00di-9500000000-6433c2be552fb96ee47e
PK$NUM_PEAK: 27
PK$PEAK: m/z int. rel.int.
  43 3.87 39
  45 5.19 52
  58 1.38 14
  59 4.14 41
  65 2.17 22
  72 1.11 11
  73 99.99 999
  74 10.29 103
  75 4.04 40
  77 1.21 12
  79 1.57 16
  91 4.12 41
  105 2.1 21
  107 2.17 22
  108 1.4 14
  119 1.54 15
  121 13.72 137
  122 1.83 18
  131 1.02 10
  133 1.19 12
  146 6.19 62
  147 1.08 11
  149 19.45 195
  150 3.04 30
  164 28.55 286
  165 4.84 48
  166 1.36 14