ACCESSION: MSBNK-Fac_Eng_Univ_Tokyo-JP002363
RECORD_TITLE: BENZYLOXYACETALDEHYDE; EI-B; MS
DATE: 2016.01.19 (Created 2008.10.21, modified 2011.05.06)
AUTHORS: MASS SPECTROSCOPY SOC. OF JAPAN (MSSJ)
LICENSE: CC BY-NC-SA

CH$NAME: BENZYLOXYACETALDEHYDE
CH$COMPOUND_CLASS: N/A
CH$FORMULA: C9H10O2
CH$EXACT_MASS: 150.06808
CH$SMILES: O=CCOCc(c1)cccc1
CH$IUPAC: InChI=1S/C9H10O2/c10-6-7-11-8-9-4-2-1-3-5-9/h1-6H,7-8H2
CH$LINK: INCHIKEY NFNOAHXEQXMCGT-UHFFFAOYSA-N
CH$LINK: COMPTOX DTXSID30209468

AC$INSTRUMENT: JEOL JMS-D-3000
AC$INSTRUMENT_TYPE: EI-B
AC$MASS_SPECTROMETRY: MS_TYPE MS
AC$MASS_SPECTROMETRY: ION_MODE POSITIVE
AC$MASS_SPECTROMETRY: IONIZATION_ENERGY 70 eV

MS$FOCUSED_ION: ION_TYPE [M]+*

PK$SPLASH: splash10-0006-9400000000-f208772c70ba9e197f44
PK$NUM_PEAK: 25
PK$PEAK: m/z int. rel.int.
  41 1.4 14
  43 2.89 29
  45 1.24 12
  50 2.15 22
  51 5.77 58
  52 1.26 13
  58 1.09 11
  63 3.01 30
  65 9.81 98
  73 2.95 30
  77 6.96 70
  78 2.15 22
  79 2.79 28
  89 3.59 36
  90 4.15 42
  91 99.99 999
  92 10.29 103
  105 6.55 66
  106 2.37 24
  107 43.88 439
  108 4.16 42
  121 1.03 10
  136 1.69 17
  149 10.82 108
  150 6.1 61