ACCESSION: MSBNK-Fac_Eng_Univ_Tokyo-JP002328
RECORD_TITLE: DECAMETHYLTETRASILANE; EI-B; MS
DATE: 2016.01.19 (Created 2008.10.21, modified 2011.05.06)
AUTHORS: MASS SPECTROSCOPY SOC. OF JAPAN (MSSJ)
LICENSE: CC BY-NC-SA

CH$NAME: DECAMETHYLTETRASILANE
CH$COMPOUND_CLASS: N/A
CH$FORMULA: C10H30Si4
CH$EXACT_MASS: 262.14246
CH$SMILES: C[Si](C)(C)[Si](C)(C)[Si](C)(C)[Si](C)(C)C
CH$IUPAC: InChI=1S/C10H30Si4/c1-11(2,3)13(7,8)14(9,10)12(4,5)6/h1-10H3
CH$LINK: INCHIKEY WYNNMDYMPQMXFH-UHFFFAOYSA-N
CH$LINK: COMPTOX DTXSID10235604

AC$INSTRUMENT: JEOL JMS-D-3000
AC$INSTRUMENT_TYPE: EI-B
AC$MASS_SPECTROMETRY: MS_TYPE MS
AC$MASS_SPECTROMETRY: ION_MODE POSITIVE
AC$MASS_SPECTROMETRY: IONIZATION_ENERGY 70 eV

MS$FOCUSED_ION: ION_TYPE [M]+*

PK$SPLASH: splash10-00di-3910000000-b4800d4b1e0176400795
PK$NUM_PEAK: 30
PK$PEAK: m/z int. rel.int.
  59 8.96 90
  73 99.99 999
  74 8.45 85
  75 5.5 55
  99 5.48 55
  101 5.23 52
  113 3.78 38
  114 3.04 30
  115 16.95 170
  116 26.13 261
  117 6.51 65
  129 15.98 160
  131 56.7 567
  132 8.38 84
  133 4.59 46
  145 5.32 53
  159 15 150
  160 2.99 30
  173 27.97 280
  174 40.8 408
  175 11.14 111
  176 4.68 47
  187 5.84 58
  189 46.26 463
  190 10.58 106
  191 5.91 59
  247 9.25 93
  262 26.11 261
  263 8.26 83
  264 4.45 45