ACCESSION: MSBNK-Fac_Eng_Univ_Tokyo-JP001610
RECORD_TITLE: BENZO(G,H,I)PERYLENE; EI-B; MS
DATE: 2016.01.19 (Created 2008.10.21, modified 2011.05.06)
AUTHORS: KOGA M, UNIV. OF OCCUPATIONAL AND ENVIRONMENTAL HEALTH
LICENSE: CC BY-NC-SA

CH$NAME: BENZO(G,H,I)PERYLENE
CH$COMPOUND_CLASS: N/A
CH$FORMULA: C22H12
CH$EXACT_MASS: 276.0939
CH$SMILES: N/A
CH$IUPAC: N/A
CH$LINK: CAS 191-24-2

AC$INSTRUMENT: VARIAN MAT-44
AC$INSTRUMENT_TYPE: EI-B
AC$MASS_SPECTROMETRY: MS_TYPE MS
AC$MASS_SPECTROMETRY: ION_MODE POSITIVE
AC$MASS_SPECTROMETRY: IONIZATION_ENERGY 70 eV

MS$FOCUSED_ION: ION_TYPE [M]+*

PK$SPLASH: splash10-002r-1960000000-227776c1aab5d76a3ec6
PK$NUM_PEAK: 40
PK$PEAK: m/z int. rel.int.
  55 6.72 67
  56 1.79 18
  57 6.27 63
  59 1.34 13
  67 1.79 18
  69 7.62 76
  70 1.34 13
  71 1.34 13
  81 2.24 22
  83 1.79 18
  91 4.93 49
  92 5.82 58
  100 1.79 18
  101 1.79 18
  111 4.48 45
  112 7.62 76
  113 6.72 67
  114 4.03 40
  123 5.82 58
  124 19.28 193
  125 20.62 206
  126 3.58 36
  135 6.27 63
  136 36.32 363
  137 78.02 780
  138 82.95 830
  139 2.24 22
  226 2.24 22
  228 10.31 103
  229 1.34 13
  248 1.79 18
  250 1.34 13
  252 4.93 49
  272 6.27 63
  273 5.38 54
  274 25.56 256
  275 16.14 161
  276 99.99 999
  277 23.76 238
  278 1.79 18