ACCESSION: MSBNK-Fac_Eng_Univ_Tokyo-JP001500
RECORD_TITLE: DIPROPYL ETHER; EI-B; MS
DATE: 2016.01.19 (Created 2008.10.21, modified 2011.05.06)
AUTHORS: YAMAMOTO M, DEP. CHEMISTRY, FAC. SCIENCE, NARA WOMEN'S UNIV.
LICENSE: CC BY-NC-SA

CH$NAME: DIPROPYL ETHER
CH$COMPOUND_CLASS: N/A
CH$FORMULA: C6H14O
CH$EXACT_MASS: 102.10447
CH$SMILES: CCCOCCC
CH$IUPAC: InChI=1S/C6H14O/c1-3-5-7-6-4-2/h3-6H2,1-2H3
CH$LINK: INCHIKEY POLCUAVZOMRGSN-UHFFFAOYSA-N
CH$LINK: COMPTOX DTXSID8042343

AC$INSTRUMENT: HITACHI RMU-6M
AC$INSTRUMENT_TYPE: EI-B
AC$MASS_SPECTROMETRY: MS_TYPE MS
AC$MASS_SPECTROMETRY: ION_MODE POSITIVE
AC$MASS_SPECTROMETRY: IONIZATION_ENERGY 70 eV

MS$FOCUSED_ION: ION_TYPE [M]+*

PK$SPLASH: splash10-0006-9000000000-d3d1fdc888b5dd7e2be1
PK$NUM_PEAK: 17
PK$PEAK: m/z int. rel.int.
  15 1.77 18
  26 1.3 13
  27 15.52 155
  28 2.24 22
  29 3.11 31
  31 6.85 69
  39 6.43 64
  40 1.21 12
  41 19.84 198
  42 4.58 46
  43 99.99 999
  44 3.56 36
  45 1.39 14
  55 4.3 43
  59 3.68 37
  73 19.54 195
  102 8.58 86