ACCESSION: MSBNK-Fac_Eng_Univ_Tokyo-JP001073
RECORD_TITLE: PARA-BETA-BIS(TRIMETHYLSILYL)OXY-CINNAMICACID TRIMETHYLSILYL ESTER; EI-B; MS
DATE: 2016.01.19 (Created 2008.10.21, modified 2011.05.06)
AUTHORS: KOGA M, UNIV. OF OCCUPATIONAL AND ENVIRONMENTAL HEALTH
LICENSE: CC BY-NC-SA

CH$NAME: PARA-BETA-BIS(TRIMETHYLSILYL)OXY-CINNAMICACID TRIMETHYLSILYL ESTER
CH$NAME: TRIMETHYLSILYL BETA,PARA-BIS(TRIMETHYLSILOXY)CINNAMATE
CH$COMPOUND_CLASS: N/A
CH$FORMULA: C18H32O4Si3
CH$EXACT_MASS: 396.16084
CH$SMILES: N/A
CH$IUPAC: N/A

AC$INSTRUMENT: JEOL JMS-01-SG
AC$INSTRUMENT_TYPE: EI-B
AC$MASS_SPECTROMETRY: MS_TYPE MS
AC$MASS_SPECTROMETRY: ION_MODE POSITIVE
AC$MASS_SPECTROMETRY: IONIZATION_ENERGY 70 eV

MS$FOCUSED_ION: ION_TYPE [M]+*

PK$SPLASH: splash10-0002-7904000000-655b763684b3af9eb170
PK$NUM_PEAK: 14
PK$PEAK: m/z int. rel.int.
  45 14.7 147
  73 63.5 635
  74 5.8 58
  75 0.83 8
  77 4.5 45
  147 99.99 999
  148 13.6 136
  149 0.71 7
  325 22.3 223
  326 7.3 73
  381 19.8 198
  382 0.66 7
  383 2.2 22
  396 2.2 22