ACCESSION: MSBNK-Fac_Eng_Univ_Tokyo-JP000914
RECORD_TITLE: DIMETHYL TRISULFIDE; EI-B; MS
DATE: 2016.01.19 (Created 2008.10.21, modified 2011.05.06)
AUTHORS: KAMEOKA H, DEPT. OF APPLIED CHEMISTRY, FAC. OF SCI. AND ENGINEERING, KINKI UNIV.
LICENSE: CC BY-NC-SA

CH$NAME: DIMETHYL TRISULFIDE
CH$COMPOUND_CLASS: N/A
CH$FORMULA: C2H6S3
CH$EXACT_MASS: 125.96316
CH$SMILES: CSSSC
CH$IUPAC: InChI=1S/C2H6S3/c1-3-5-4-2/h1-2H3
CH$LINK: INCHIKEY YWHLKYXPLRWGSE-UHFFFAOYSA-N
CH$LINK: COMPTOX DTXSID9063118

AC$INSTRUMENT: SHIMADZU LKB-9000B
AC$INSTRUMENT_TYPE: EI-B
AC$MASS_SPECTROMETRY: MS_TYPE MS
AC$MASS_SPECTROMETRY: ION_MODE POSITIVE
AC$MASS_SPECTROMETRY: IONIZATION_ENERGY 70 eV

MS$FOCUSED_ION: ION_TYPE [M]+*

PK$SPLASH: splash10-004i-8900000000-51e17f5b584d2fdfd191
PK$NUM_PEAK: 17
PK$PEAK: m/z int. rel.int.
  45 14.9 149
  46 4.6 46
  47 19.4 194
  48 0.1 1
  61 11 110
  62 0.8 8
  64 7.6 76
  78 0.95 10
  79 39.1 391
  80 16.5 165
  81 4.2 42
  82 0.1 1
  111 14.8 148
  113 1.9 19
  126 99.99 999
  127 0.48 5
  128 13.3 133