ACCESSION: MSBNK-Fac_Eng_Univ_Tokyo-JP000869
RECORD_TITLE: DIALLYLHYDRAZONE ACRYLALDEHYDE; EI-B; MS
DATE: 2016.01.19 (Created 2008.10.21, modified 2011.05.06)
AUTHORS: SASAKI S, TOYOHASHI UNIV. OF TECH.
LICENSE: CC BY-NC-SA

CH$NAME: DIALLYLHYDRAZONE ACRYLALDEHYDE
CH$NAME: ACRYLALDEHYDE DIALLYLHYDRAZONE
CH$COMPOUND_CLASS: N/A
CH$FORMULA: C9H14N2
CH$EXACT_MASS: 150.11570
CH$SMILES: C=CC=NN(CC=C)CC=C
CH$IUPAC: InChI=1S/C9H14N2/c1-4-7-10-11(8-5-2)9-6-3/h4-7H,1-3,8-9H2/b10-7+
CH$LINK: INCHIKEY UBWAKKDBDWRUAI-JXMROGBWSA-N

AC$INSTRUMENT: SHIMADZU LKB-2091
AC$INSTRUMENT_TYPE: EI-B
AC$MASS_SPECTROMETRY: MS_TYPE MS
AC$MASS_SPECTROMETRY: ION_MODE POSITIVE
AC$MASS_SPECTROMETRY: IONIZATION_ENERGY 70 eV

MS$FOCUSED_ION: ION_TYPE [M]+*

PK$SPLASH: splash10-0006-9100000000-52853bb32d9b4121556a
PK$NUM_PEAK: 31
PK$PEAK: m/z int. rel.int.
  29 4 40
  38 1.8 18
  39 31.5 315
  40 1.4 14
  41 99.99 999
  42 6.2 62
  52 0.9 9
  53 1.65 17
  54 7.5 75
  55 8.8 88
  56 2.3 23
  65 0.18 2
  66 2.2 22
  67 2.9 29
  68 5.5 55
  69 0.45 5
  77 2 20
  79 7.8 78
  80 2.1 21
  81 2.48 25
  82 2.7 27
  94 1.8 18
  95 0.9 9
  107 0.07 1
  109 12.2 122
  110 0.9 9
  123 3.3 33
  124 0.03 0
  149 0.9 9
  150 22 220
  151 2.2 22