ACCESSION: MSBNK-Fac_Eng_Univ_Tokyo-JP000826
RECORD_TITLE: DIMETHYLHYDRAZONE ACETALDEHYDE; EI-B; MS
DATE: 2016.01.19 (Created 2008.10.21, modified 2011.05.06)
AUTHORS: SASAKI S, TOYOHASHI UNIV. OF TECH.
LICENSE: CC BY-NC-SA

CH$NAME: DIMETHYLHYDRAZONE ACETALDEHYDE
CH$NAME: ACETALDEHYDE DIMETHYLHYDRAZONE
CH$COMPOUND_CLASS: N/A
CH$FORMULA: C4H10N2
CH$EXACT_MASS: 86.08440
CH$SMILES: CC=NN(C)C
CH$IUPAC: InChI=1S/C4H10N2/c1-4-5-6(2)3/h4H,1-3H3/b5-4+
CH$LINK: INCHIKEY FDWQPDLACZBQBC-SNAWJCMRSA-N

AC$INSTRUMENT: SHIMADZU LKB-2091
AC$INSTRUMENT_TYPE: EI-B
AC$MASS_SPECTROMETRY: MS_TYPE MS
AC$MASS_SPECTROMETRY: ION_MODE POSITIVE
AC$MASS_SPECTROMETRY: IONIZATION_ENERGY 70 eV

MS$FOCUSED_ION: ION_TYPE [M]+*

PK$SPLASH: splash10-000f-9000000000-8b0beada9b8a9c41ffc9
PK$NUM_PEAK: 20
PK$PEAK: m/z int. rel.int.
  27 15.2 152
  28 32.6 326
  29 3.3 33
  30 3.48 35
  39 2.6 26
  40 6.1 61
  41 10 100
  42 7.81 78
  43 32.6 326
  44 91.1 911
  45 19.6 196
  55 0.18 2
  56 9.4 94
  58 3.5 35
  71 26.1 261
  72 0.13 1
  83 1.5 15
  85 30.5 305
  86 99.99 999
  87 7.2 72