ACCESSION: MSBNK-Fac_Eng_Univ_Tokyo-JP000620
RECORD_TITLE: GLUCOSYLCERAMIDE; FD-B; MS
DATE: 2016.01.19 (Created 2008.10.21, modified 2011.05.06)
AUTHORS: KUSHI Y, DEPT. OF BIOCHEMISTRY, FAC. OF MEDICINE, TOKYO MEDICAL AND DENTAL UNIV.
LICENSE: CC BY-NC-SA

CH$NAME: GLUCOSYLCERAMIDE
CH$NAME: 1-O-GLUCOSYL-N-HEXADECYL-4-SPHINGENINE
CH$COMPOUND_CLASS: N/A
CH$FORMULA: C40H77NO8
CH$EXACT_MASS: 699.56492
CH$SMILES: N/A
CH$IUPAC: N/A

AC$INSTRUMENT: Unknown
AC$INSTRUMENT_TYPE: FD-B
AC$MASS_SPECTROMETRY: MS_TYPE MS
AC$MASS_SPECTROMETRY: ION_MODE POSITIVE

MS$FOCUSED_ION: ION_TYPE [M]+*

PK$SPLASH: splash10-00di-0000000900-a71a3f0035c0eb468b3e
PK$NUM_PEAK: 14
PK$PEAK: m/z int. rel.int.
  163 2.2 22
  239 1.5 15
  462 2 20
  537 0.2 2
  538 6.2 62
  560 4.3 43
  681 1 10
  682 0.17 2
  699 3 30
  722 99.99 999
  723 45.8 458
  738 0.74 7
  739 1.8 18
  961 1.8 18