ACCESSION: MSBNK-Fac_Eng_Univ_Tokyo-JP000375
RECORD_TITLE: BENZYLHYDRAZINE; EI-B; MS
DATE: 2016.01.19 (Created 2008.10.21, modified 2011.05.06)
AUTHORS: SASAKI S, TOYOHASHI UNIV. OF TECH.
LICENSE: CC BY-NC-SA

CH$NAME: BENZYLHYDRAZINE
CH$COMPOUND_CLASS: N/A
CH$FORMULA: C7H10N2
CH$EXACT_MASS: 122.08440
CH$SMILES: NNCc(c1)cccc1
CH$IUPAC: InChI=1S/C7H10N2/c8-9-6-7-4-2-1-3-5-7/h1-5,9H,6,8H2
CH$LINK: INCHIKEY NHOWLEZFTHYCTP-UHFFFAOYSA-N
CH$LINK: COMPTOX DTXSID2043749

AC$INSTRUMENT: SHIMADZU LKB-2091
AC$INSTRUMENT_TYPE: EI-B
AC$MASS_SPECTROMETRY: MS_TYPE MS
AC$MASS_SPECTROMETRY: ION_MODE POSITIVE
AC$MASS_SPECTROMETRY: IONIZATION_ENERGY 70 eV

MS$FOCUSED_ION: ION_TYPE [M]+*

PK$SPLASH: splash10-0006-9200000000-025a151b83e51b6616e2
PK$NUM_PEAK: 34
PK$PEAK: m/z int. rel.int.
  27 1.4 14
  30 1.1 11
  31 2.7 27
  38 0.09 1
  39 5.6 56
  41 1.5 15
  43 2.5 25
  44 0.1 1
  45 2.7 27
  50 2.6 26
  51 5.8 58
  52 0.18 2
  62 0.8 8
  63 2.7 27
  64 0.8 8
  65 1.38 14
  66 1 10
  76 0.9 9
  77 5.7 57
  78 0.22 2
  79 1.4 14
  89 2 20
  90 0.8 8
  91 99.99 999
  92 16 160
  93 3 30
  103 0.8 8
  104 0.28 3
  105 1.1 11
  106 2.5 25
  107 1.5 15
  121 0.08 1
  122 31.8 318
  123 3.1 31