ACCESSION: MSBNK-Fac_Eng_Univ_Tokyo-JP000336
RECORD_TITLE: BERYLLIUM DIACETONATE; EI-B; MS
DATE: 2016.01.19 (Created 2008.10.21, modified 2011.05.06)
AUTHORS: SASAKI S, TOYOHASHI UNIV. OF TECH.
LICENSE: CC BY-NC-SA

CH$NAME: BERYLLIUM DIACETONATE
CH$COMPOUND_CLASS: N/A
CH$FORMULA: C10H14BeO4
CH$EXACT_MASS: 207.10139
CH$SMILES: N/A
CH$IUPAC: N/A

AC$INSTRUMENT: HITACHI RMU-6D
AC$INSTRUMENT_TYPE: EI-B
AC$MASS_SPECTROMETRY: MS_TYPE MS
AC$MASS_SPECTROMETRY: ION_MODE POSITIVE
AC$MASS_SPECTROMETRY: IONIZATION_ENERGY 70 eV

MS$FOCUSED_ION: ION_TYPE [M]+*

PK$SPLASH: splash10-0006-4930000000-be28aa2fa355cf5ae969
PK$NUM_PEAK: 39
PK$PEAK: m/z int. rel.int.
  15 1.3 13
  17 1.5 15
  26 1 10
  27 0.1 1
  28 5 50
  39 2.5 25
  40 0.5 5
  41 0.01 0
  42 0.5 5
  43 18 180
  44 0.5 5
  50 0.05 1
  52 2 20
  53 0.5 5
  64 1.5 15
  65 0.02 0
  66 14 140
  67 1 10
  68 1.5 15
  78 0.04 0
  79 2 20
  80 5 50
  82 0.5 5
  86 0.02 0
  92 0.7 7
  96 2 20
  107 3.5 35
  108 0.78 8
  109 4 40
  126 0.3 3
  134 0.3 3
  150 0.03 0
  165 4 40
  178 2 20
  192 99.99 999
  193 0.1 1
  194 1 10
  207 42.5 425
  208 4 40