ACCESSION: MSBNK-Fac_Eng_Univ_Tokyo-JP000204
RECORD_TITLE: BENZYL METHYL ETHER; EI-B; MS
DATE: 2016.01.19 (Created 2008.10.21, modified 2011.05.06)
AUTHORS: TAJIMA S, GUNMA COLLEGE OF TECHNOLOGY
LICENSE: CC BY-NC-SA

CH$NAME: BENZYL METHYL ETHER
CH$COMPOUND_CLASS: N/A
CH$FORMULA: C8H10O
CH$EXACT_MASS: 122.07316
CH$SMILES: COCc(c1)cccc1
CH$IUPAC: InChI=1S/C8H10O/c1-9-7-8-5-3-2-4-6-8/h2-6H,7H2,1H3
CH$LINK: INCHIKEY GQKZBCPTCWJTAS-UHFFFAOYSA-N
CH$LINK: COMPTOX DTXSID5060227

AC$INSTRUMENT: HITACHI RMU-7M
AC$INSTRUMENT_TYPE: EI-B
AC$MASS_SPECTROMETRY: MS_TYPE MS
AC$MASS_SPECTROMETRY: ION_MODE POSITIVE
AC$MASS_SPECTROMETRY: IONIZATION_ENERGY 70 eV

MS$FOCUSED_ION: ION_TYPE [M]+*

PK$SPLASH: splash10-006x-9500000000-bff6c0b0485eeba1ad97
PK$NUM_PEAK: 23
PK$PEAK: m/z int. rel.int.
  15 1.29 13
  29 1.43 14
  39 5.67 57
  41 1.58 16
  45 4.16 42
  50 2.8 28
  51 7.1 71
  52 1.58 16
  63 3.95 40
  65 13.85 139
  77 20.44 204
  78 2.3 23
  79 5.6 56
  89 5.02 50
  90 2.51 25
  91 99.99 999
  92 23.89 239
  93 2.08 21
  105 3.59 36
  107 1.43 14
  121 60.33 603
  122 56.89 569
  123 4.52 45