ACCESSION: MSBNK-Fac_Eng_Univ_Tokyo-JP000152
RECORD_TITLE: DESTRUXINE-A; FD-B; MS
DATE: 2016.01.19 (Created 2008.10.21, modified 2011.05.06)
AUTHORS: FUKUSHIMA K, INST. FOR CHEMOBIODYNAMICS, CHIBA UNIV.
LICENSE: CC BY-NC-SA

CH$NAME: DESTRUXINE-A
CH$COMPOUND_CLASS: N/A
CH$FORMULA: C29H47N5O7
CH$EXACT_MASS: 577.34755
CH$SMILES: N/A
CH$IUPAC: N/A

AC$INSTRUMENT: Unknown
AC$INSTRUMENT_TYPE: FD-B
AC$MASS_SPECTROMETRY: MS_TYPE MS
AC$MASS_SPECTROMETRY: ION_MODE POSITIVE

MS$FOCUSED_ION: ION_TYPE [M]+*

PK$SPLASH: splash10-004i-0000090000-45743b792ed76c129e58
PK$NUM_PEAK: 20
PK$PEAK: m/z int. rel.int.
  280 6.29 63
  289 9.09 91
  335 7.15 72
  354 6.34 63
  391 5.57 56
  490 5.67 57
  523 6.96 70
  526 10.71 107
  535 14.75 148
  561 5.38 54
  562 5.11 51
  563 10.86 109
  564 11.73 117
  577 99.99 999
  578 49.05 491
  579 15.71 157
  580 6.13 61
  591 5.9 59
  593 6.92 69
  661 5.69 57