ACCESSION: MSBNK-Antwerp_Univ-AN111515
RECORD_TITLE: Butyryl trihexyl citrate; LC-ESI-QTOF; MS2; CE: 15eV; R=7000; [M+Na]+
DATE: 2021.08.02
AUTHORS: Belova L, Covaci A, University of Antwerp, Belgium; Caballero-Casero N, University of Cordoba, Spain.
LICENSE: CC BY
COPYRIGHT: Copyright (c) 2021 by Toxicological Center, University of Antwerp, Wilrijk, Belgium
COMMENT: CONFIDENCE Reference Standard (Level 1)
COMMENT: INTERNAL_ID 1115
COMMENT: HBM4EU - science and policy for a healthy future (https://www.hbm4eu.eu)

CH$NAME: Butyryl trihexyl citrate
CH$NAME: trihexyl 2-butanoyloxypropane-1,2,3-tricarboxylate
CH$COMPOUND_CLASS: N/A; Environmental Standard
CH$FORMULA: C28H50O8
CH$EXACT_MASS: 514.3506
CH$SMILES: CCCCCCOC(=O)CC(CC(=O)OCCCCCC)(C(=O)OCCCCCC)OC(=O)CCC
CH$IUPAC: InChI=1S/C28H50O8/c1-5-9-12-15-19-33-25(30)22-28(36-24(29)18-8-4,27(32)35-21-17-14-11-7-3)23-26(31)34-20-16-13-10-6-2/h5-23H2,1-4H3
CH$LINK: CAS 82469-79-2
CH$LINK: PUBCHEM CID:133914
CH$LINK: INCHIKEY GWVUTNGDMGTPFE-UHFFFAOYSA-N
CH$LINK: CHEMSPIDER 118086
CH$LINK: COMPTOX DTXSID0047535

AC$INSTRUMENT: Agilent 6560 QTOF
AC$INSTRUMENT_TYPE: LC-ESI-QTOF
AC$MASS_SPECTROMETRY: MS_TYPE MS2
AC$MASS_SPECTROMETRY: ION_MODE POSITIVE
AC$MASS_SPECTROMETRY: IONIZATION ESI
AC$MASS_SPECTROMETRY: FRAGMENTATION_MODE CID
AC$MASS_SPECTROMETRY: COLLISION_ENERGY 15 eV
AC$MASS_SPECTROMETRY: RESOLUTION 7000
AC$MASS_SPECTROMETRY: MASS_RANGE_M/Z 57-1141
AC$CHROMATOGRAPHY: FLOW_GRADIENT 50/50 isocratic
AC$CHROMATOGRAPHY: FLOW_RATE 200 uL/min
AC$CHROMATOGRAPHY: RETENTION_TIME 0.147 min

MS$FOCUSED_ION: BASE_PEAK 537.3419
MS$FOCUSED_ION: PRECURSOR_M/Z 537.3398
MS$FOCUSED_ION: PRECURSOR_TYPE [M+Na]+
MS$FOCUSED_ION: PRECURSOR_INTENSITY 648158.98
MS$DATA_PROCESSING: RECALIBRATE loess on assigned fragments and MS1
MS$DATA_PROCESSING: REANALYZE Peaks with additional N2/O included
MS$DATA_PROCESSING: WHOLE RMassBank 3.1.1

PK$SPLASH: splash10-000i-0000090000-81200867a4673a196274
PK$ANNOTATION: m/z tentative_formula formula_count mass error(ppm)
  235.0937 C11H16NaO4+ 2 235.0941 -1.49
  337.198 C17H30NaO5+ 4 337.1985 -1.71
  338.2002 C24H27Na+ 4 338.2005 -0.85
  365.194 C18H30NaO6+ 4 365.1935 1.42
  383.2024 C18H32NaO7+ 4 383.204 -4.28
  449.287 C24H42NaO6+ 2 449.2874 -0.8
  450.2906 C24H43NaO6+ 2 450.2952 -10.1
  453.2451 C22H38NaO8+ 2 453.2459 -1.68
  467.2967 C24H44NaO7+ 2 467.2979 -2.67
  537.3396 C28H50NaO8+ 1 537.3398 -0.26
PK$NUM_PEAK: 10
PK$PEAK: m/z int. rel.int.
  235.0937 1342.5 2
  337.198 5919 11
  338.2002 1016.3 2
  365.194 1670.8 3
  383.2024 2523.1 5
  449.287 39766.5 79
  450.2906 6534.4 13
  453.2451 2240.5 4
  467.2967 1843 3
  537.3396 501539.5 999