ACCESSION: MSBNK-NAIST-KNA00784
RECORD_TITLE: L-(+)-Arginine; LC-ESI-ITFT; MS; NEG
DATE: 2016.01.19 (Created 2009.11.19, modified 2011.08.03)
AUTHORS: Takahashi H, Kanaya S, Ogasawara N, Graduate School of Information Science, NAIST
LICENSE: CC BY-SA

CH$NAME: L-Arginine
CH$NAME: (S)-2-Amino-5-guanidinovaleric acid
CH$NAME: L-(+)-Arginine
CH$COMPOUND_CLASS: Natural Product
CH$FORMULA: C6H14N4O2
CH$EXACT_MASS: 174.11168
CH$SMILES: NC(=N)NCCC[C@H](N)C(O)=O
CH$IUPAC: InChI=1S/C6H14N4O2/c7-4(5(11)12)2-1-3-10-6(8)9/h4H,1-3,7H2,(H,11,12)(H4,8,9,10)/t4-/m0/s1
CH$LINK: CAS 74-79-3
CH$LINK: CHEBI 16467
CH$LINK: KEGG C00062
CH$LINK: KNAPSACK C00001340
CH$LINK: NIKKAJI J9.182K
CH$LINK: PUBCHEM 3362
CH$LINK: INCHIKEY ODKSFYDXXFIFQN-BYPYZUCNSA-N
CH$LINK: COMPTOX DTXSID6041056

AC$INSTRUMENT: LTQ Orbitrap XL, Thermo Scientfic
AC$INSTRUMENT_TYPE: LC-ESI-ITFT
AC$MASS_SPECTROMETRY: MS_TYPE MS
AC$MASS_SPECTROMETRY: ION_MODE NEGATIVE
AC$MASS_SPECTROMETRY: COLLISION_ENERGY 35eV
AC$MASS_SPECTROMETRY: IONIZATION ESI
AC$CHROMATOGRAPHY: COLUMN_NAME TOSOH TSKgel ODS-100V 5um Part no. 21456
AC$CHROMATOGRAPHY: FLOW_GRADIENT 0min:3%, 45min:97%, 50min:97%, 50.1:3%, 57min:3% (acetonitrile)
AC$CHROMATOGRAPHY: FLOW_RATE 0.5 ml/min
AC$CHROMATOGRAPHY: RETENTION_TIME 4.115618 min
AC$CHROMATOGRAPHY: SOLVENT A 0.1%formate-water
AC$CHROMATOGRAPHY: SOLVENT B 0.1%formate-acetonitrile

MS$FOCUSED_ION: BASE_PEAK 241.091507

PK$SPLASH: splash10-03kd-0977452210-639a2a034ca097589b04
PK$NUM_PEAK: 1307
PK$PEAK: m/z int. rel.int.
  101.394700 703.084839 1
  102.366303 858.492554 1
  102.948957 1436.045288 1
  102.957049 15976.748047 13
  104.842391 696.663086 1
  104.954030 4065.047363 3
  106.695618 764.232910 1
  108.266276 681.367432 1
  110.009952 832.198242 1
  112.088108 3825.797363 3
  112.923193 2072.130127 2
  112.925913 1260.108521 1
  112.931808 746.777466 1
  112.962651 926.176880 1
  112.965146 7874.535645 6
  112.974901 999.224609 1
  112.975808 1438.030273 1
  112.977623 2669.266846 2
  112.978304 2822.996582 2
  112.980346 4569.061035 4
  112.982388 13013.449219 10
  112.983069 9807.112305 8
  112.984203 41384.277344 33
  112.986018 1043371.625000 836
  112.987834 46188.449219 37
  112.988968 8911.324219 7
  112.989649 12486.906250 10
  112.990783 3420.779053 3
  112.991691 5046.947754 4
  112.992372 2932.385986 2
  112.994187 2133.419189 2
  112.994641 2178.445801 2
  112.997137 1386.091309 1
  112.998499 1477.161743 1
  112.999634 896.197388 1
  113.006896 8283.917969 7
  113.009166 872.867676 1
  113.048669 2851.898926 2
  113.099101 696.840210 1
  113.301391 809.383545 1
  113.576911 761.252686 1
  113.681950 757.692505 1
  113.940934 831.168335 1
  113.988975 7035.728027 6
  114.055914 1811.539917 1
  114.990201 1803.898560 1
  116.806442 759.164795 1
  117.398512 791.048218 1
  117.981536 821.114380 1
  118.085230 738.930420 1
  118.397376 713.823364 1
  118.993016 2313.978760 2
  122.990749 898.632080 1
  123.341192 882.821655 1
  127.824485 757.696045 1
  127.842235 943.325928 1
  129.975772 6454.515137 5
  131.056673 2298.197754 2
  131.067728 1036.793701 1
  131.070280 1185.251831 1
  131.072264 1535.065063 1
  131.075383 1348.390259 1
  131.077084 2708.700684 2
  131.078218 4603.239258 4
  131.079069 3714.096924 3
  131.080487 14497.701172 12
  131.081337 9279.252930 7
  131.082755 400866.093750 321
  131.085023 17264.910156 14
  131.086441 2500.454346 2
  131.087575 3990.001465 3
  131.089844 1303.028076 1
  131.090978 910.033813 1
  131.108845 2608.793945 2
  132.085984 17080.617188 14
  132.087705 1165.015747 1
  133.086850 803.210693 1
  134.118794 828.157715 1
  134.502570 804.223389 1
  134.769681 694.995361 1
  135.312244 717.444824 1
  137.401716 771.167847 1
  137.672326 758.657471 1
  139.007093 1989.310913 2
  139.141265 780.753052 1
  139.900352 866.237793 1
  142.067343 872.121582 1
  142.946387 2173.895508 2
  142.996125 1289.288452 1
  144.580882 775.442505 1
  145.213904 891.151855 1
  145.444613 827.419189 1
  146.938359 3555.331543 3
  146.960908 915.749390 1
  150.039810 762.146851 1
  150.429808 741.780762 1
  150.982782 2209.416748 2
  153.487017 725.966553 1
  154.116213 805.851929 1
  154.136819 740.447510 1
  154.213495 690.876343 1
  154.392387 804.916260 1
  154.500452 761.045288 1
  154.882852 723.105347 1
  154.960085 1094.707642 1
  156.070283 910.500977 1
  156.075072 975.256714 1
  156.077651 25317.791016 20
  157.011649 20749.833984 17
  157.514285 807.243042 1
  158.015209 1387.756958 1
  159.978750 811.039429 1
  161.098981 799.080078 1
  162.968245 1137.135620 1
  162.982789 10004.824219 8
  164.999094 2960.722900 2
  170.366599 930.500366 1
  170.941521 2020.017944 2
  170.944055 1891.264526 2
  171.542702 711.094482 1
  171.544400 713.789673 1
  172.985645 1738.287231 1
  173.065195 5565.382324 4
  173.078530 1224.213623 1
  173.080251 818.896729 1
  173.081542 1239.544434 1
  173.083693 1431.300049 1
  173.085414 1270.902588 1
  173.088425 2611.152100 2
  173.090146 2392.277832 2
  173.093158 3290.721924 3
  173.094449 2800.004150 2
  173.097891 10598.364258 8
  173.099181 7576.285645 6
  173.100903 30423.892578 24
  173.104775 943220.875000 755
  173.108218 33904.328125 27
  173.110369 5490.999512 4
  173.111660 9335.372070 7
  173.113812 3140.036133 3
  173.115533 3520.607666 3
  173.116824 2976.526611 2
  173.119836 1951.608032 2
  173.121127 1711.847656 1
  173.125431 1158.804932 1
  173.128444 1433.736572 1
  173.144369 5236.205566 4
  173.223597 2163.388428 2
  174.101316 8178.329590 7
  174.103920 1129.445679 1
  174.107826 40540.125000 32
  174.955987 1736.865601 1
  175.108238 1987.959595 2
  175.110427 1040.074951 1
  176.779756 914.713989 1
  178.059364 1686.904419 1
  178.272333 784.220947 1
  178.977758 27883.294922 22
  178.980020 1001.933594 1
  179.141631 980.214233 1
  180.930674 1661.307861 1
  180.948608 3529.811523 3
  180.961945 1384.813477 1
  180.966084 3003.918701 2
  180.967004 2207.637451 2
  180.969304 8070.524902 6
  180.973443 298331.750000 239
  180.977123 9495.916992 8
  180.978963 2344.716797 2
  180.980803 2613.373047 2
  180.983103 1201.561035 1
  181.015767 1889.244507 2
  181.020829 717.382324 1
  181.459683 773.190552 1
  181.976173 5010.425293 4
  182.032305 784.343872 1
  182.976972 1037.094116 1
  184.354842 1992.579468 2
  185.185239 787.149292 1
  186.118124 713.377441 1
  186.119563 739.448608 1
  186.929570 1307.587524 1
  190.927875 7666.320313 6
  195.086217 2618.756348 2
  197.963492 1163.741089 1
  198.933207 707.586914 1
  198.935857 9170.670898 7
  199.069514 23947.273438 19
  200.437109 792.832031 1
  201.045927 1576.981323 1
  202.323556 912.874512 1
  203.690274 862.679199 1
  204.956640 1239.899902 1
  204.993233 2643.224854 2
  205.582840 898.021851 1
  206.963082 2776.193848 2
  206.965332 1594.143066 1
  206.967583 4563.968262 4
  206.972646 174037.078125 139
  206.977146 5931.578613 5
  206.979959 860.660156 1
  206.982209 1348.380005 1
  206.994025 1685.127686 1
  207.708183 1011.873901 1
  207.975954 3320.946045 3
  210.949558 1321.058350 1
  217.393201 772.151611 1
  218.250808 843.490112 1
  218.899184 972.286255 1
  218.904079 12051.979492 10
  224.998804 2968.140869 2
  225.117451 3269.792725 3
  225.779382 878.050415 1
  226.204293 902.150269 1
  227.728886 753.644653 1
  230.889622 836.697632 1
  231.005000 1010.513184 1
  231.062721 12000.879883 10
  231.985203 1131.069092 1
  232.065999 1285.023682 1
  232.986439 6846.050781 5
  233.059692 5040.260254 4
  233.831954 838.380371 1
  234.076696 947.477417 1
  234.959456 2627.914063 2
  235.170535 872.076294 1
  236.914920 5212.767090 4
  238.127291 723.915161 1
  238.726167 807.653564 1
  238.931179 7504.481934 6
  240.834119 850.317749 1
  240.895563 1977.234253 2
  240.928767 3345.825928 3
  241.026299 5756.205078 5
  241.051752 1188.663818 1
  241.053873 874.217896 1
  241.065187 2547.487061 2
  241.068015 2357.677002 2
  241.072258 4211.580566 3
  241.080037 10753.511719 9
  241.082159 7114.412598 6
  241.085695 33868.347656 27
  241.087817 18691.666016 15
  241.091353 1247495.875000 999
  241.097011 38785.460938 31
  241.101255 7432.620117 6
  241.103377 10660.943359 9
  241.106913 2637.420410 2
  241.109742 4244.103516 3
  241.111864 2902.644775 2
  241.113986 1709.074463 1
  241.116816 2061.816650 2
  241.126012 1301.885864 1
  241.128134 848.290894 1
  241.130964 1092.822144 1
  241.133794 1120.261597 1
  241.156433 5787.396484 5
  241.287381 1854.210815 1
  242.088122 9608.112305 8
  242.090968 1484.404297 1
  242.094527 82190.187500 66
  242.100220 1793.562622 1
  242.904299 8612.028320 7
  242.942926 1518.234375 1
  243.067456 10994.289063 9
  243.095381 4340.156250 3
  247.051431 1118.460938 1
  248.754897 1110.993042 1
  248.892083 4395.735352 4
  248.914340 1567.707520 1
  248.928438 1380.828369 1
  248.932148 1320.916626 1
  248.935858 1993.008667 2
  248.940311 3022.694092 2
  248.948474 7470.979004 6
  248.950700 4817.532715 4
  248.954411 21014.919922 17
  248.960348 803808.187500 644
  248.966285 24331.429688 19
  248.969996 4885.738770 4
  248.972965 6444.858398 5
  248.975934 2194.621094 2
  248.978903 2485.610840 2
  248.981872 1601.954224 1
  248.984841 796.880127 1
  248.986325 875.442871 1
  249.028640 3770.411621 3
  249.165310 1511.172119 1
  249.963055 21105.191406 17
  250.785644 744.879395 1
  250.964320 9646.423828 8
  252.969779 8528.612305 7
  253.140901 887.666748 1
  253.164492 784.803711 1
  254.916306 2990.757813 2
  255.959115 775.362549 1
  256.919617 2774.489258 2
  256.954632 12483.851563 10
  257.086975 736.712524 1
  258.024863 810.834839 1
  258.082036 2279.882080 2
  258.896259 1125.743286 1
  258.915936 919.312500 1
  260.914909 6155.989258 5
  260.938002 823.592529 1
  261.078217 1884.758911 2
  261.481167 785.815063 1
  262.787358 784.300293 1
  263.074115 1041.233154 1
  264.909607 2179.564697 2
  267.056843 3844.793945 3
  270.826468 791.719727 1
  270.881210 781.846680 1
  273.029148 3967.113281 3
  281.036701 4117.363770 3
  282.896433 2955.426270 2
  284.522448 744.047974 1
  284.914559 2091.308105 2
  284.985443 1468.243042 1
  285.117286 5166.123047 4
  286.930482 1312.441650 1
  287.095841 1066.568115 1
  289.072776 21448.826172 17
  289.943879 888.348267 1
  290.970777 1176.993408 1
  292.986047 6899.314453 6
  293.056174 1726.488647 1
  293.105467 2032.776245 2
  296.914549 2828.581543 2
  297.568086 814.391235 1
  299.049631 4587.344238 4
  300.973888 7578.499512 6
  302.839098 934.869629 1
  302.925741 949.021851 1
  304.878538 1623.148071 1
  306.919348 10096.416016 8
  307.083985 1879.495728 2
  308.916081 1427.170166 1
  308.984821 1887.077026 2
  309.062823 3111.611084 2
  309.065903 2751.894775 2
  309.071035 10999.208008 9
  309.074115 6537.036621 5
  309.079248 423193.843750 339
  309.087461 11151.904297 9
  309.092594 2240.491211 2
  309.096701 3149.347656 3
  309.104915 1316.453125 1
  309.109022 930.859863 1
  309.174745 1330.197021 1
  310.076443 4845.881348 4
  310.082632 29326.470703 23
  310.941686 822.238281 1
  311.082617 1961.223755 2
  311.086763 758.752686 1
  313.942497 891.045166 1
  313.987692 796.921387 1
  314.925323 17692.687500 14
  316.849455 3044.978516 2
  316.918728 2111.903320 2
  316.922992 1297.758545 1
  316.930454 4840.310547 4
  316.933652 2418.732666 2
  316.938982 17025.560547 14
  316.942180 9298.987305 7
  316.947510 673204.062500 539
  316.956039 16797.640625 13
  316.961369 3348.553223 3
  316.965634 4940.104004 4
  316.981627 1123.022827 1
  316.986958 1182.288452 1
  317.046677 2513.525635 2
  317.243016 931.256592 1
  317.950919 29850.386719 24
  318.951567 9083.367188 7
  319.034450 1658.540527 1
  321.007288 902.691406 1
  322.904182 2304.187500 2
  324.906439 1020.955566 1
  326.069129 1625.928833 1
  326.902810 3641.552246 3
  327.042439 1326.171021 1
  327.175450 4901.020996 4
  331.061513 776.271484 1
  332.916341 1031.392822 1
  332.935852 41106.199219 33
  333.938940 1757.324341 1
  334.888669 923.286011 1
  334.910669 4053.179688 3
  335.045033 12688.555664 10
  335.078637 15827.666016 13
  335.101815 839.971680 1
  336.080956 1187.476929 1
  340.133172 733.016113 1
  340.426095 795.339966 1
  341.016646 985.140747 1
  341.566988 830.151001 1
  342.969085 1010.516357 1
  345.597720 751.243774 1
  347.215345 21695.105469 17
  348.218631 1535.234131 1
  350.375789 934.447144 1
  353.105243 3515.281982 3
  354.904738 1712.751221 1
  354.917370 4340.189941 3
  360.931324 3432.560303 3
  360.974079 4862.802734 4
  361.093316 3771.974854 3
  364.013497 13432.070313 11
  365.016725 1032.795410 1
  365.718679 844.065063 1
  365.951350 813.223511 1
  367.038319 5547.391113 4
  368.040745 1083.860718 1
  368.961575 3480.540771 3
  369.033890 1130.256958 1
  369.177245 1908.207153 2
  369.179925 2025.035278 2
  369.186626 4472.086914 4
  369.190647 1999.236694 2
  369.197348 226419.625000 181
  369.208070 5528.312988 4
  369.216112 1107.044434 1
  369.220133 1633.210327 1
  369.322024 974.720459 1
  370.193835 3337.727783 3
  370.200564 23367.812500 19
  371.174096 2684.966064 2
  371.945390 819.539917 1
  374.906567 3250.390381 3
  376.900374 1313.351074 1
  376.939085 2426.776367 2
  377.028973 1699.947388 1
  377.033122 1529.891357 1
  377.040038 1261.510010 1
  377.048337 4905.401855 4
  377.055253 10491.257813 8
  377.059403 7399.458984 6
  377.066320 518005.781250 415
  377.077387 12869.753906 10
  377.084304 2485.103760 2
  377.089838 3295.628174 3
  377.193619 1982.828003 2
  378.069856 46543.402344 37
  379.070432 5593.638672 4
  382.913039 1498.846191 1
  382.962591 1597.562622 1
  383.022066 2325.509521 2
  383.756735 1190.324707 1
  384.802804 786.991455 1
  384.891240 867.895386 1
  384.896946 1170.415527 1
  384.901226 1172.181274 1
  384.916920 4085.204102 3
  384.922628 6715.410645 5
  384.935469 323582.375000 259
  384.946884 7116.217285 6
  384.959727 2093.431885 2
  384.982560 1152.187012 1
  385.061064 910.343750 1
  385.481112 776.694946 1
  385.937657 13901.371094 11
  386.939450 4152.768066 3
  387.021430 1130.096436 1
  387.515302 800.125977 1
  390.892417 976.109497 1
  392.007407 1289.225586 1
  393.040303 3219.771240 3
  393.219969 1768.111694 1
  394.056594 1103.968262 1
  394.889962 4088.529785 3
  395.162898 3024.305664 2
  400.514936 851.603394 1
  400.908961 2717.087646 2
  402.010762 822.042480 1
  402.897004 2890.040039 2
  403.031492 9597.302734 8
  404.034633 1411.174194 1
  405.172465 999.805420 1
  408.214186 924.265015 1
  411.940324 1009.214722 1
  413.554690 771.110962 1
  415.202540 11672.372070 9
  415.760953 847.709595 1
  416.206569 1353.080811 1
  417.011452 997.591064 1
  417.178826 3012.174072 2
  418.869461 801.175049 1
  421.092327 4003.832031 3
  422.954699 888.879150 1
  423.071404 1744.871948 1
  424.751710 912.764526 1
  425.968267 31989.453125 26
  426.926614 3550.647461 3
  426.971616 2370.744629 2
  427.156698 1472.271118 1
  428.960441 3048.380371 2
  429.081321 4259.895020 3
  430.083899 996.638794 1
  431.331915 1623.419067 1
  435.024720 6459.782227 5
  436.949323 2376.687256 2
  437.021809 1543.850220 1
  437.170288 2633.857666 2
  437.185831 151001.125000 121
  437.199648 3349.719238 3
  438.116459 848.703857 1
  438.189235 20785.859375 17
  442.893709 3829.561035 3
  443.964555 2966.170898 2
  443.978694 147495.296875 118
  443.992834 3208.165039 3
  444.890329 1385.756592 1
  444.938200 4982.078613 4
  444.982533 10493.370117 8
  445.012683 1221.779663 1
  445.025099 3023.843506 2
  445.030420 1842.893677 1
  445.039289 10184.121094 8
  445.044610 4572.032715 4
  445.053479 476356.156250 381
  445.067671 9827.279297 8
  445.078314 1919.693970 2
  445.083637 2865.817871 2
  445.216720 1279.713501 1
  445.984443 1996.735229 2
  446.057408 48019.699219 38
  447.059381 4820.365723 4
  447.950073 3481.273682 3
  448.233219 779.059937 1
  448.971014 1079.649780 1
  451.010726 1165.580078 1
  452.871301 1493.806030 1
  452.880405 1454.863159 1
  452.885868 1535.221191 1
  452.898614 2045.335815 2
  452.907719 3791.342773 3
  452.922288 194009.343750 155
  452.936857 3578.793213 3
  452.953248 1180.503296 1
  453.925565 9571.393555 8
  454.494348 907.665649 1
  454.926679 3477.700439 3
  455.009185 1268.805420 1
  458.878998 922.649780 1
  461.027821 5745.184570 5
  461.209286 2181.928711 2
  461.990621 2862.790039 2
  462.045032 1336.813477 1
  462.877407 1145.073486 1
  463.150343 5007.154297 4
  463.184242 5783.772949 5
  464.155697 971.399170 1
  465.219301 862.468506 1
  465.786659 814.779053 1
  465.946238 1702.490845 1
  465.961440 57005.042969 46
  466.703451 835.935181 1
  466.964527 3238.865234 3
  467.798767 855.093506 1
  467.965118 1513.189697 1
  468.896025 2519.351807 2
  469.931703 6815.050781 5
  469.943251 834.103271 1
  470.885861 1494.830566 1
  471.021027 5829.533691 5
  471.051931 1419.162354 1
  471.943638 1562.143188 1
  471.959135 3884.653320 3
  471.964946 3318.877686 3
  471.974632 208126.140625 167
  471.990130 4390.126465 4
  472.007567 1184.000488 1
  472.933079 5217.103027 4
  472.977774 19347.390625 15
  473.586648 794.668213 1
  473.822342 875.678467 1
  473.978269 3518.617920 3
  475.322429 2406.162354 2
  483.191572 16140.542969 13
  483.971112 3109.877441 2
  484.194472 1367.171265 1
  487.944090 14051.432617 11
  489.080332 2671.734131 2
  489.984809 17685.748047 14
  490.988387 2458.002930 2
  491.060336 5272.752441 4
  491.980619 1097.970093 1
  493.035839 1294.383423 1
  493.938869 3944.076172 3
  493.955461 202834.125000 162
  493.974129 4109.148926 3
  494.958787 18264.808594 15
  495.143998 2521.002441 2
  495.960999 2127.580811 2
  496.949513 1686.094849 1
  497.066742 4451.456055 4
  497.140031 993.067261 1
  498.073266 1104.317261 1
  503.013465 5047.281250 4
  504.935108 2040.456421 2
  505.010145 1274.745728 1
  505.138817 1359.786255 1
  505.155977 3804.074707 3
  505.173138 179425.968750 144
  505.190300 3099.436768 2
  505.201027 957.605103 1
  505.209608 1080.773682 1
  505.370552 849.388428 1
  505.954886 1700.471069 1
  506.176425 22457.240234 18
  507.180545 1728.922485 1
  507.312207 1205.647949 1
  509.993235 928.652588 1
  510.882180 3112.318604 2
  511.955049 1494.679688 1
  511.965992 14078.436523 11
  512.925938 1205.131592 1
  513.007153 2080.931885 2
  513.013739 1423.797485 1
  513.022520 6573.911621 5
  513.042279 379047.937500 304
  513.059844 7678.539063 6
  513.070822 2161.849121 2
  513.079604 1585.470947 1
  513.244324 1141.466309 1
  514.044888 40949.242188 33
  515.046022 4896.985352 4
  515.912791 928.707397 1
  515.937146 42478.179688 34
  516.941595 2695.202881 2
  517.982387 1704.308838 1
  518.724866 940.971802 1
  519.312398 4420.893066 4
  520.701409 820.876831 1
  520.878796 1028.895630 1
  520.892272 3001.900879 2
  520.899010 2130.409424 2
  520.910241 162257.281250 130
  520.928211 3334.429688 3
  520.968647 1029.993896 1
  520.975387 975.059082 1
  521.328283 4207.690430 3
  521.913486 12150.200195 10
  521.956290 2090.993408 2
  522.915114 4473.414551 4
  522.996453 1511.755005 1
  526.866049 1590.783447 1
  529.015763 3899.464355 3
  529.197416 11978.648438 10
  530.030999 976.291504 1
  530.864242 1058.817139 1
  531.005233 1867.470093 1
  531.137030 4705.426270 4
  533.948771 50858.703125 41
  534.272933 856.418945 1
  534.952532 3422.387939 3
  535.308028 6133.818848 5
  535.954439 1352.477051 1
  536.313280 1385.806030 1
  536.883946 2145.980957 2
  537.304895 1162.188843 1
  537.895999 1012.758667 1
  537.983217 1553.112549 1
  538.877829 1168.661011 1
  539.007839 6892.158203 6
  539.040940 2192.275879 2
  539.950044 990.290649 1
  539.961897 24889.880859 20
  540.916113 833.921509 1
  540.966030 3276.198730 3
  541.149117 933.522461 1
  543.307965 6374.592773 5
  543.937766 1290.439331 1
  544.977051 1021.977417 1
  547.475776 845.604370 1
  551.177967 32032.302734 26
  551.958679 1268.517822 1
  552.181694 3971.996094 3
  552.787702 802.790649 1
  552.986650 1121.355469 1
  554.984527 2229.618164 2
  555.931804 4895.416504 4
  557.067765 3443.974854 3
  557.184535 1230.322021 1
  558.070195 1022.451172 1
  559.047861 13649.945313 11
  559.965506 1010.170898 1
  560.050634 1650.322266 1
  561.923334 3024.023682 2
  561.943468 164465.265625 132
  561.963602 2923.572510 2
  562.946475 14007.923828 11
  563.302456 18343.267578 15
  563.947109 3035.388184 2
  564.306573 2153.057861 2
  564.937729 2289.039307 2
  565.056982 3887.911621 3
  565.293062 12706.117188 10
  565.920787 2065.631836 2
  566.297416 1796.067017 1
  567.332531 1720.440063 1
  571.001074 5317.066895 4
  572.923832 2038.735229 2
  573.136343 2170.665039 2
  573.159674 157371.890625 126
  573.180415 2743.747559 2
  574.164281 21243.839844 17
  575.166318 2802.371094 2
  577.920394 1179.365601 1
  578.869128 3473.473633 3
  579.954752 4702.157227 4
  580.786841 1161.063843 1
  580.958764 1000.580078 1
  580.987867 1930.399048 2
  580.995804 1225.176392 1
  581.009033 6235.695313 5
  581.030201 319205.000000 256
  581.048724 5965.000977 5
  581.064602 2194.000488 2
  581.075187 2083.285400 2
  581.273715 1083.258057 1
  582.031703 27537.855469 22
  583.033138 7071.129883 6
  583.115599 1461.173096 1
  583.925176 35228.851563 28
  584.039825 1129.825195 1
  584.928831 3779.819824 3
  585.927036 803.605835 1
  585.969911 1134.447876 1
  586.984218 1747.439575 1
  587.904195 921.355347 1
  588.308376 818.462280 1
  588.829036 847.027832 1
  588.839834 816.721558 1
  588.874930 2456.122314 2
  588.896529 140362.953125 112
  588.918130 2273.511475 2
  589.315248 3902.933594 3
  589.902206 8650.847656 7
  590.899606 2978.565186 2
  590.983741 848.373535 1
  593.882419 972.359131 1
  597.003608 3458.004395 3
  597.182783 9025.632813 7
  598.019080 1503.572632 1
  598.187655 2827.202637 2
  598.851597 1458.069092 1
  598.992827 1562.618530 1
  599.125795 4599.918457 4
  599.159044 947.145508 1
  600.080029 35390.132813 28
  601.083874 4262.627930 3
  601.936752 21916.394531 18
  602.084657 1187.445190 1
  602.939667 2504.888428 2
  603.931070 997.235718 1
  604.871516 1497.186035 1
  605.907137 2076.183838 2
  606.993448 4873.099609 4
  607.030180 2188.862305 2
  607.949555 4826.850586 4
  609.089644 997.869263 1
  611.296647 4891.144531 4
  611.931057 1581.287109 1
  612.434714 1084.126709 1
  615.100675 921.277344 1
  617.186898 1013.621704 1
  619.167303 28187.771484 23
  619.974384 909.578003 1
  620.169836 1780.549438 1
  622.062021 27923.064453 22
  623.065719 4517.729004 4
  623.918712 2983.523926 2
  624.068902 1791.234497 1
  625.056795 2890.959717 2
  625.174909 1411.259155 1
  626.047036 1370.684570 1
  627.036665 9352.389648 7
  629.786699 841.122070 1
  629.912130 1153.815063 1
  629.930052 24194.552734 19
  630.934895 1301.746704 1
  631.120575 1459.207886 1
  631.936141 1318.502563 1
  632.924730 1566.531860 1
  633.042073 4190.162109 3
  633.279866 13494.270508 11
  633.936750 836.052612 1
  634.283683 1146.975708 1
  635.320143 2281.166260 2
  638.987664 2166.716797 2
  640.911507 2348.701172 2
  641.123078 1590.855957 1
  641.147614 102287.468750 82
  641.172152 1481.818604 1
  641.930459 1122.380005 1
  642.151758 12801.960938 10
  642.994967 894.360107 1
  643.152098 3140.834229 3
  644.043597 14262.496094 11
  646.086509 11806.691406 9
  646.856661 1587.115234 1
  647.089842 2144.814209 2
  647.942799 16192.724609 13
  648.947338 2302.204834 2
  648.991066 4644.588867 4
  649.000437 2186.662354 2
  649.016056 252777.843750 202
  649.041047 4764.060547 4
  650.019961 21790.751953 17
  651.023060 4433.242676 4
  651.101524 959.309937 1
  651.358988 840.243774 1
  651.912110 29820.587891 24
  652.916441 2397.016357 2
  653.919935 1379.521973 1
  654.973246 1598.903809 1
  656.829829 1312.355713 1
  656.858453 1355.869629 1
  656.883899 75130.414063 60
  657.303964 6014.540527 5
  657.447259 1036.510010 1
  657.886993 5425.635742 4
  658.308020 1143.151245 1
  658.889191 3030.417969 2
  658.975474 1449.363647 1
  662.054368 1305.459839 1
  662.866154 867.583496 1
  664.989628 4777.227539 4
  665.148409 955.317139 1
  665.171097 19736.066406 16
  666.008106 975.494385 1
  666.027590 4575.703125 4
  666.176997 2901.220459 2
  666.983361 1180.076294 1
  667.113557 5510.479004 4
  668.068405 21078.986328 17
  669.071078 2721.039551 2
  669.925290 3078.411133 2
  671.921533 2075.728271 2
  672.079511 849.821045 1
  672.860345 1672.610962 1
  673.896965 1784.068970 1
  674.982364 5070.726074 4
  675.015497 2422.263428 2
  675.937561 11834.769531 9
  676.941370 1154.330811 1
  679.286731 3939.367188 3
  679.912657 860.679443 1
  680.287957 1406.989502 1
  687.154692 29646.453125 24
  687.934680 1795.473022 1
  688.006273 1503.309448 1
  688.156315 2478.813721 2
  689.160131 1314.447754 1
  690.029142 961.131470 1
  690.049690 25034.419922 20
  691.026764 1020.266602 1
  691.054220 1964.499634 2
  691.768666 1061.829468 1
  691.906186 1620.504639 1
  692.057506 998.650024 1
  693.042296 1746.886108 1
  693.901396 1087.219238 1
  695.021654 18341.062500 15
  696.026657 3365.192627 3
  697.917793 16666.636719 13
  698.922104 3065.842773 2
  699.925086 1303.829834 1
  700.912699 1270.333130 1
  701.031914 2551.908203 2
  701.266927 14268.377930 11
  702.271447 1651.245728 1
  703.309840 2659.013428 2
  704.311691 1154.039673 1
  706.974842 3920.611328 3
  708.900106 1497.273560 1
  708.967864 1476.095581 1
  709.106978 1369.111328 1
  709.135519 69722.953125 56
  710.139122 9211.028320 7
  711.141274 2038.698364 2
  712.034256 9293.192383 7
  713.036827 1231.174561 1
  713.115973 1239.596191 1
  714.073961 13016.947266 10
  715.080844 1723.566284 1
  715.930589 7016.835449 6
  716.567986 937.543091 1
  716.930523 1060.005371 1
  716.974046 2245.634521 2
  716.984927 1132.598755 1
  717.003063 162351.906250 130
  717.032082 3475.255859 3
  718.008880 15724.731445 13
  719.005888 2972.706299 2
  719.093316 1078.644043 1
  719.899132 16561.482422 13
  720.903737 3265.330566 3
  720.940308 1405.415894 1
  722.955991 962.322754 1
  724.873199 50887.164063 41
  725.290030 6778.578125 5
  725.877154 5759.894043 5
  726.298549 934.573120 1
  726.879492 2513.061279 2
  726.960954 2514.935303 2
  728.236503 814.767090 1
  732.978596 2104.991455 2
  733.158590 23002.906250 18
  733.252364 1083.295288 1
  733.988171 1055.010986 1
  734.014470 5774.764160 5
  734.161021 2346.709717 2
  735.018657 1215.994385 1
  735.101491 3318.947998 3
  735.135382 1396.749268 1
  735.161743 951.530640 1
  736.055088 9821.037109 8
  737.911047 1335.326782 1
  737.998158 775.681763 1
  739.907104 1197.397461 1
  740.847211 1923.029907 2
  741.880728 3002.517334 2
  742.969971 3393.326904 3
  743.004407 1448.239624 1
  743.923591 10353.347656 8
  744.925140 1903.329468 2
  746.533372 849.813110 1
  747.269969 2714.924316 2
  747.652194 903.592163 1
  748.274418 1170.233521 1
  748.839344 887.541504 1
  749.277020 1006.768799 1
  751.408899 851.436523 1
  755.119498 1185.876099 1
  755.143021 23369.423828 19
  755.998423 1474.961792 1
  756.143750 3191.670410 3
  758.036822 9537.241211 8
  759.039360 1846.538208 1
  761.149587 1449.823975 1
  763.009733 21146.361328 17
  764.014176 4169.871582 3
  765.012608 1296.334595 1
  765.904862 7365.124512 6
  766.911017 986.019287 1
  767.095627 1281.347290 1
  769.021944 1901.645386 2
  769.255686 10916.044922 9
  770.256336 4122.186523 3
  771.295362 5180.406738 4
  774.193052 2417.554199 2
  774.962821 1505.468140 1
  777.123474 38219.367188 31
  777.184872 1003.726685 1
  777.860729 1062.970703 1
  778.127218 6643.374512 5
  780.021173 10898.166992 9
  781.022290 2521.498047 2
  781.055281 1726.794312 1
  782.062522 19009.349609 15
  783.067573 2999.895996 2
  784.066266 1124.417603 1
  784.992071 80352.976563 64
  785.025314 1300.553467 1
  785.994450 9047.657227 7
  786.998749 3245.171143 3
  787.887970 9885.494141 8
  788.891716 1571.140503 1
  790.606691 939.586548 1
  792.862669 27304.988281 22
  793.094705 1177.093994 1
  793.115805 1101.669922 1
  793.276187 6413.988281 5
  793.863261 2273.075684 2
  793.909748 970.974243 1
  793.990054 1049.925171 1
  794.277562 871.579346 1
  794.865749 1456.530762 1
  794.950434 1075.314331 1
  795.217280 913.301514 1
  796.171400 1219.501831 1
  800.967855 2931.142578 2
  801.147761 23195.634766 19
  802.000998 2481.302246 2
  802.151206 4854.994629 4
  803.087737 3417.361572 3
  803.147937 1539.387451 1
  803.591047 879.062622 1
  803.750312 805.520142 1
  804.043138 11201.408203 9
  805.047714 2415.750000 2
  807.890520 1715.825195 1
  808.493896 989.261597 1
  809.872471 3501.542725 3
  810.434478 956.258911 1
  810.957800 2952.327393 2
  810.992707 1403.482788 1
  811.909801 14234.390625 11
  812.916023 2346.413818 2
  813.915344 1595.499512 1
  815.052773 1078.365723 1
  815.259435 2489.972168 2
  815.549774 958.203003 1
  818.001825 1075.188599 1
  818.156551 2086.848145 2
  818.988400 2537.501953 2
  820.012250 1801.235474 1
  820.203049 1156.380981 1
  822.921380 1931.554810 2
  823.131042 20974.652344 17
  823.979428 1241.066040 1
  824.135853 3155.115234 3
  826.025400 5669.985352 5
  827.035517 944.397583 1
  829.016220 1153.076172 1
  829.250773 1022.845459 1
  830.009240 1911.269897 2
  830.999520 15309.863281 12
  831.502120 898.098022 1
  832.005176 2289.804688 2
  832.436082 1098.720947 1
  833.003573 1167.094849 1
  833.044455 1421.602539 1
  833.894569 6012.275391 5
  836.891674 1046.865112 1
  837.001463 1882.414673 2
  837.243990 11229.586914 9
  838.059288 1223.139526 1
  838.247250 2450.293457 2
  839.100750 1116.876709 1
  839.284469 5406.761230 4
  840.139555 1928.324829 2
  840.286798 1734.462769 1
  842.181399 3128.788086 3
  845.111920 23728.619141 19
  846.110760 5942.432617 5
  847.116029 1962.282593 2
  848.006441 9845.654297 8
  849.010418 1600.104614 1
  849.094553 1270.404419 1
  850.048955 13856.073242 11
  851.028418 809.988281 1
  851.047181 1265.147217 1
  852.978312 38161.312500 31
  853.981704 5861.927246 5
  854.628014 880.451050 1
  854.982144 1866.219849 1
  855.875529 4184.847168 3
  856.590298 910.357788 1
  856.912473 1367.394409 1
  857.410307 974.519409 1
  857.429281 799.618164 1
  860.845284 12008.628906 10
  861.055285 1124.907715 1
  861.083927 1381.620239 1
  861.265363 5457.643555 4
  861.896057 1173.581787 1
  862.120790 1018.049194 1
  862.269066 2205.158936 2
  863.082873 1129.254517 1
  864.166543 1670.251587 1
  868.599075 1006.568726 1
  869.136174 16522.718750 13
  869.988812 1665.243530 1
  870.139123 2334.594971 2
  871.075804 2101.239502 2
  871.143809 2101.589600 2
  872.033459 11124.889648 9
  873.031682 2073.541992 2
  874.930588 3212.227295 3
  877.861834 2473.885742 2
  878.653532 890.716064 1
  878.948849 1600.873657 1
  878.978389 1771.982056 1
  879.899796 11705.335938 9
  880.901680 2333.656006 2
  881.405736 970.759644 1
  881.905277 943.093140 1
  883.247729 1284.591064 1
  886.146145 974.279297 1
  887.233609 1216.357910 1
  888.003025 2406.949463 2
  888.183033 1465.686401 1
  889.184074 1056.568359 1
  891.115847 11497.803711 9
  891.965810 1349.057861 1
  892.116817 2329.464600 2
  894.012707 3164.177002 3
  896.913566 1953.186401 2
  898.987713 9714.285156 8
  899.986677 2570.710205 2
  901.882136 6816.212891 5
  905.232925 5564.633789 4
  906.237164 1580.484497 1
  907.268891 5969.700195 5
  908.126562 2898.441162 2
  908.276521 1183.651123 1
  909.130443 1269.194092 1
  910.161928 1869.994263 1
  910.940590 872.296265 1
  913.100102 15668.066406 13
  914.101801 2075.732422 2
  914.958724 1666.743652 1
  915.094688 950.753906 1
  915.110378 855.089355 1
  915.994909 5543.860352 4
  918.035778 11103.477539 9
  918.892978 2849.354736 2
  919.040348 2558.321777 2
  920.130933 829.003296 1
  920.922426 908.867188 1
  920.964668 14216.108398 11
  921.974050 1893.900269 2
  922.974497 1152.769897 1
  923.865152 7777.992188 6
  924.868679 2305.802246 2
  925.517328 881.238159 1
  925.873843 1385.640503 1
  928.835004 5366.982422 4
  929.252306 5595.951660 4
  930.259266 1611.106323 1
  931.192698 972.046387 1
  931.966257 1065.852783 1
  932.149044 1212.339722 1
  936.135287 1128.012939 1
  937.120938 16235.185547 13
  937.983303 1272.301880 1
  938.124432 3291.086914 3
  940.021904 9845.861328 8
  941.024609 2437.563721 2
  941.373752 980.278564 1
  947.890160 1525.765137 1
  951.234735 1477.616821 1
  956.175948 3184.998047 3
  957.126291 1178.313599 1
  959.104181 6865.346191 5
  962.000786 2942.094727 2
  962.959829 1185.978516 1
  965.981695 1380.150513 1
  966.969422 6467.447754 5
  969.867518 1023.623535 1
  973.214458 3957.740723 3
  974.224791 2001.568237 2
  975.225190 909.865723 1
  975.259714 6641.826660 5
  976.117649 4093.168457 3
  976.261709 1905.318970 2
  977.969802 1587.775757 1
  978.154729 2716.273926 2
  981.085877 8390.515625 7
  982.091051 2308.769531 2
  983.977734 6529.593750 5
  984.800489 954.883179 1
  984.981516 1627.830078 1
  986.021933 7267.444336 6
  986.068732 1145.644897 1
  987.028845 1099.185059 1
  988.953285 8591.503906 7
  989.876426 1335.518677 1
  989.958807 1343.940186 1
  991.850514 4107.782227 3
  991.962654 1049.763916 1
  996.826510 2722.296387 2
  997.236916 3216.515137 3
  998.249144 1235.433716 1
  1000.134795 1238.145752 1
  1003.892113 923.925049 1
  1005.113136 8020.692871 6
  1005.896242 1381.495728 1
  1005.962547 2959.854736 2
  1005.980631 2760.354736 2
  1006.107234 2577.804199 2
  1008.003113 5231.987305 4
  1009.013614 1533.153931 1
  1015.872884 1629.579956 1
  1020.076238 1070.880859 1
  1024.163295 4212.975098 3
  1027.092348 1972.187378 2
  1028.088099 1083.678589 1
  1029.984021 1492.388184 1
  1033.339629 1088.349609 1
  1034.960677 3584.948730 3
  1037.847764 1057.455933 1
  1041.210168 3134.092773 3
  1042.207455 1236.026978 1
  1043.212541 910.466309 1
  1043.244371 5298.322754 4
  1044.104340 3574.560059 3
  1044.250959 1427.793945 1
  1045.718850 1061.531982 1
  1046.140642 2658.601074 2
  1047.599709 887.367920 1
  1049.074669 5754.585938 5
  1050.076850 1429.753784 1
  1051.975931 5046.221680 4
  1052.975818 1861.479370 1
  1054.015920 5613.891602 4
  1055.018718 2659.114502 2
  1056.944210 5424.253418 4
  1057.944690 1230.268433 1
  1059.832569 3231.198486 3
  1063.977506 948.932373 1
  1064.810723 1234.096069 1
  1068.127019 1110.657959 1
  1073.097379 5669.382324 5
  1074.100935 1238.814697 1
  1075.992233 4505.267090 4
  1076.999853 1679.615356 1
  1091.181517 1219.192993 1
  1092.149179 2091.754883 2
  1094.129393 973.901489 1
  1095.080440 1475.661743 1
  1097.982274 1336.312500 1
  1102.948160 1643.069580 1
  1103.162725 921.035522 1
  1104.215692 1424.064819 1
  1104.992528 828.185669 1
  1105.867448 1051.526123 1
  1105.971674 5455.742188 4
  1106.499981 995.682129 1
  1106.966040 1653.221802 1
  1108.505426 876.975708 1
  1109.196056 2324.337646 2
  1111.236832 3718.412598 3
  1112.091153 3474.222900 3
  1114.132901 3410.382568 3
  1115.138296 2322.903809 2
  1117.061468 6255.953125 5
  1117.979013 1085.300171 1
  1118.070830 1253.194092 1
  1119.959108 3064.205078 2
  1120.965310 1757.602905 1
  1121.994170 4483.985352 4
  1124.925294 2817.448975 2
  1125.838273 888.966797 1
  1127.832138 2698.856934 2
  1129.193000 916.355225 1
  1130.477331 1111.499878 1
  1132.800416 1310.539063 1
  1133.218322 1931.841187 2
  1136.099510 1450.878296 1
  1136.121215 1640.995728 1
  1137.113058 1174.419434 1
  1140.096392 1194.868286 1
  1141.086164 1293.107056 1
  1143.975498 3024.932617 2
  1145.446255 1027.419067 1
  1149.374805 996.127930 1
  1151.852423 1082.962402 1
  1156.059034 988.364868 1
  1160.139403 2387.375488 2
  1164.196383 917.805542 1
  1165.984589 4037.792969 3
  1166.993207 2094.305420 2
  1169.301382 1104.648682 1
  1177.014440 909.095337 1
  1177.182298 1507.963379 1
  1179.230005 2235.930176 2
  1180.079687 1373.416992 1
  1182.127282 1539.215088 1
  1185.042957 1338.176270 1
  1187.946226 2225.401855 2
  1189.983316 2244.953613 2
  1195.813557 1218.614502 1
  1204.106563 1194.858887 1
  1205.323164 836.000732 1
  1205.963805 3112.591553 2
  1207.960179 1309.071289 1
  1209.071418 1865.295776 1
  1211.967827 1329.632690 1
  1215.827234 1730.023071 1
  1217.350481 956.212402 1
  1219.037403 1119.720459 1
  1224.046439 896.055054 1
  1228.126343 1165.183350 1
  1246.021639 1020.830444 1
  1247.210788 1360.866943 1
  1248.068363 1174.037109 1
  1250.103432 1098.290405 1
  1250.153538 1174.314941 1
  1253.039671 1044.621094 1
  1257.948013 801.549805 1
  1257.981731 1025.483154 1
  1265.985801 7564.075195 6
  1266.990613 2525.049072 2
  1267.988091 1439.230591 1
  1296.279334 881.633057 1
  1298.009308 995.528931 1
  1313.142583 1108.517090 1
  1331.208371 1031.074219 1
  1338.765002 1086.734009 1
  1365.983712 7652.875000 6
  1366.976232 2293.615479 2
  1414.410707 975.618774 1
  1425.856264 806.717041 1
  1426.161479 1068.942749 1
  1432.388831 883.067017 1
  1443.587322 952.482544 1
  1446.035990 870.635864 1
  1446.794678 936.920776 1
  1465.978848 3522.507813 3
  1480.174583 941.891479 1
  1487.788907 1322.018433 1
  1493.486476 1031.781738 1