ACCESSION: MSBNK-NAIST-KNA00756
RECORD_TITLE: L-Aspartic acid; LC-ESI-ITFT; MS; NEG
DATE: 2016.01.19 (Created 2009.11.19, modified 2011.08.03)
AUTHORS: Takahashi H, Kanaya S, Ogasawara N, Graduate School of Information Science, NAIST
LICENSE: CC BY-SA

CH$NAME: L-Aspartate
CH$NAME: L-Aspartic acid
CH$NAME: 2-Aminosuccinic acid
CH$COMPOUND_CLASS: Natural Product
CH$FORMULA: C4H7NO4
CH$EXACT_MASS: 133.03751
CH$SMILES: OC(=O)CC(N)C(O)=O
CH$IUPAC: InChI=1S/C4H7NO4/c5-2(4(8)9)1-3(6)7/h2H,1,5H2,(H,6,7)(H,8,9)/t2-/m0/s1
CH$LINK: CAS 56-84-8
CH$LINK: CHEBI 17053
CH$LINK: KEGG C00049
CH$LINK: KNAPSACK C00001342
CH$LINK: NIKKAJI J9.169C
CH$LINK: PUBCHEM 3351
CH$LINK: INCHIKEY CKLJMWTZIZZHCS-REOHCLBHSA-N
CH$LINK: COMPTOX DTXSID7022621

AC$INSTRUMENT: LTQ Orbitrap XL, Thermo Scientfic
AC$INSTRUMENT_TYPE: LC-ESI-ITFT
AC$MASS_SPECTROMETRY: MS_TYPE MS
AC$MASS_SPECTROMETRY: ION_MODE NEGATIVE
AC$MASS_SPECTROMETRY: COLLISION_ENERGY 35eV
AC$MASS_SPECTROMETRY: IONIZATION ESI
AC$CHROMATOGRAPHY: COLUMN_NAME TOSOH TSKgel ODS-100V 5um Part no. 21456
AC$CHROMATOGRAPHY: FLOW_GRADIENT 0min:3%, 45min:97%, 50min:97%, 50.1:3%, 57min:3% (acetonitrile)
AC$CHROMATOGRAPHY: FLOW_RATE 0.5 ml/min
AC$CHROMATOGRAPHY: RETENTION_TIME 4.747328 min
AC$CHROMATOGRAPHY: SOLVENT A 0.1%formate-water
AC$CHROMATOGRAPHY: SOLVENT B 0.1%formate-acetonitrile

MS$FOCUSED_ION: BASE_PEAK 132.029984

PK$SPLASH: splash10-001i-0921000000-ab58a19e686435ff3450
PK$NUM_PEAK: 444
PK$PEAK: m/z int. rel.int.
  101.073402 894.189453 1
  103.374450 879.538208 1
  103.449551 717.700684 1
  104.242884 818.951904 1
  104.415223 759.440918 1
  104.489242 692.761841 1
  104.490049 640.414673 1
  104.927907 1374.654785 1
  105.727247 873.202759 1
  106.300763 853.259644 1
  107.116710 802.172729 1
  107.227177 736.520508 1
  107.274603 731.903076 1
  108.263163 705.866821 1
  108.645556 783.943604 1
  111.163952 792.058838 1
  112.192293 764.394409 1
  112.819513 668.566040 1
  112.937107 1297.023071 1
  112.950713 649.322388 1
  112.985421 12410.028320 12
  113.527614 716.093750 1
  113.702188 799.020996 1
  114.019645 1633.247803 2
  114.233868 690.451172 1
  114.951622 3729.272217 4
  114.997041 1034.716431 1
  115.003565 7584.443848 7
  117.345984 710.451050 1
  120.670385 806.515015 1
  122.131053 1082.629395 1
  122.857716 909.998901 1
  123.620482 865.713623 1
  123.951717 2238.984863 2
  124.519430 763.197754 1
  124.890670 760.347534 1
  125.311793 685.205078 1
  127.380412 1106.526978 1
  127.611328 762.428467 1
  127.657913 946.388550 1
  128.258718 720.833252 1
  130.704006 767.132080 1
  130.892797 799.387085 1
  131.137590 856.921265 1
  131.950811 2902.109863 3
  132.003518 4355.697266 4
  132.014120 1852.215332 2
  132.016699 1158.104370 1
  132.017272 945.811768 1
  132.018419 2284.976807 2
  132.019278 2391.734131 2
  132.020711 2417.941162 2
  132.021571 3139.308105 3
  132.023004 6830.949707 7
  132.025010 67696.984375 65
  132.027590 40723.484375 39
  132.029883 1047643.250000 999
  132.032462 39449.597656 38
  132.034756 12152.296875 12
  132.036762 4678.948242 4
  132.037909 3620.341553 3
  132.041348 2578.269287 2
  132.042208 784.962646 1
  132.043068 1274.864868 1
  132.047082 1126.155029 1
  132.056543 3893.343018 4
  132.109026 2545.812744 2
  132.133127 913.820190 1
  133.026632 1415.078857 1
  133.033009 25504.964844 24
  133.034748 965.074829 1
  133.035618 1206.008301 1
  134.033831 3796.114990 4
  134.046731 2592.032959 2
  136.529933 894.417114 1
  139.006578 4795.997070 5
  139.145400 822.200073 1
  139.456021 924.106812 1
  143.882622 866.983398 1
  144.252775 997.242920 1
  146.555595 901.217529 1
  148.952117 1486.073608 1
  151.946469 1794.725342 2
  153.339588 875.625977 1
  154.011561 1085.146606 1
  154.946723 4204.959961 4
  154.959478 2059.526367 2
  155.987556 1322.886475 1
  156.894379 1972.304932 2
  158.003325 999.250854 1
  158.146010 906.893433 1
  158.399188 749.984863 1
  158.925159 1529.924683 1
  159.893276 1490.735840 1
  159.970083 1388.123779 1
  159.982698 1280.187866 1
  162.137101 872.962158 1
  162.823035 811.024414 1
  165.175949 786.349365 1
  165.962036 3104.376465 3
  169.987144 904.986694 1
  170.179081 912.006226 1
  172.009858 798.113525 1
  173.756043 874.511597 1
  173.998188 2058.916260 2
  174.842489 865.590088 1
  174.917641 4252.557617 4
  181.687698 841.729858 1
  181.790922 796.010254 1
  184.343146 2021.494629 2
  187.964392 2527.337158 2
  187.987277 2168.544922 2
  188.119800 909.623047 1
  188.336426 776.738281 1
  192.928345 1362.944214 1
  192.960245 809.289185 1
  193.956654 4778.678711 5
  194.003103 834.567139 1
  194.078172 813.717896 1
  200.269011 797.485962 1
  201.992980 1761.762207 2
  203.959257 4833.246094 5
  204.450479 932.085571 1
  204.780055 766.632080 1
  204.921308 793.298950 1
  211.966944 2169.755859 2
  213.979855 1018.919067 1
  214.913125 1514.899780 1
  214.925626 1910.923584 2
  215.981390 1544.339355 1
  216.856589 692.612793 1
  217.006898 1480.225586 1
  218.693272 958.247070 1
  218.864457 676.472412 1
  218.903614 808.436890 1
  221.925518 2242.368896 2
  222.152427 836.147339 1
  227.920045 919.059204 1
  229.828266 827.889160 1
  231.953985 966.387329 1
  232.291404 779.032349 1
  233.938884 745.844238 1
  236.185100 814.207275 1
  238.869250 1118.867554 1
  239.961776 1149.636353 1
  240.870299 1147.841187 1
  243.837682 751.494263 1
  246.022601 1677.815063 2
  246.935733 1163.698486 1
  247.421043 755.783813 1
  248.938266 1050.439697 1
  250.941972 835.458374 1
  251.975579 3009.276123 3
  252.157041 865.355225 1
  252.894730 2546.310303 2
  253.954964 1681.132446 2
  254.891896 940.001221 1
  256.502521 766.884155 1
  256.723864 815.204102 1
  257.970260 1033.357788 1
  258.965735 998.328125 1
  261.029816 2672.110107 3
  265.059775 2852.192627 3
  265.067113 120554.906250 115
  265.072005 2392.270020 2
  265.073636 2857.530762 3
  265.080974 1274.984131 1
  266.063808 1321.981934 1
  266.070367 6651.205566 6
  267.070257 1198.040649 1
  272.043334 1416.147095 1
  272.956942 3141.641113 3
  273.959953 814.832031 1
  273.988227 1768.679932 2
  275.015889 876.420166 1
  275.229706 850.466675 1
  277.981382 795.379517 1
  279.021047 872.019043 1
  283.527892 849.098145 1
  286.932546 856.035645 1
  287.049202 34074.222656 32
  287.154897 705.262207 1
  287.574575 851.055664 1
  288.052432 1080.406128 1
  289.017296 2092.795410 2
  289.024723 77210.390625 74
  289.031221 1044.573608 1
  289.033078 951.213867 1
  289.945037 2096.111328 2
  290.028071 5504.917969 5
  290.991633 1458.349731 1
  294.024625 767.854492 1
  297.700243 877.011108 1
  301.576773 945.517090 1
  303.013637 8021.917969 8
  303.243969 865.930664 1
  305.994176 5365.888672 5
  308.982991 2671.375732 3
  309.031224 5758.558594 5
  309.581067 918.074097 1
  312.735537 768.141357 1
  312.862006 1073.900269 1
  313.983717 4062.032471 4
  314.063619 3408.219971 3
  314.897048 679.827759 1
  315.881182 795.045776 1
  315.981972 1124.566162 1
  316.991459 2404.940186 2
  317.977937 20496.042969 20
  317.988650 1513.649292 1
  318.986248 24439.873047 23
  319.989629 2258.374756 2
  320.986887 1786.866943 2
  324.912223 1282.481201 1
  324.995227 2829.684814 3
  325.183485 1073.300171 1
  326.993535 5746.165039 5
  327.993436 988.715820 1
  328.919023 1194.056396 1
  329.952685 1641.093018 2
  331.012845 2870.027832 3
  333.929985 2810.449951 3
  335.350240 896.081909 1
  339.077569 1743.427246 2
  340.968147 14838.013672 14
  342.101008 911.922485 1
  342.968162 918.709717 1
  346.053633 1525.796265 1
  346.939532 1315.686646 1
  347.353789 1124.261963 1
  347.962466 1901.142090 2
  348.975150 5538.090820 5
  349.940311 1137.161865 1
  349.978654 757.058838 1
  350.186560 721.195679 1
  351.230118 836.569336 1
  355.897435 1094.738403 1
  356.941160 931.816528 1
  357.897363 771.900513 1
  361.965039 1881.296143 2
  362.342645 827.775757 1
  370.867883 972.820190 1
  372.256222 798.551270 1
  376.976708 1053.539429 1
  377.109496 863.404053 1
  383.973009 996.783936 1
  384.221896 765.990356 1
  387.912241 843.795898 1
  399.014188 929.423218 1
  402.009540 1472.642822 1
  404.970992 1810.881104 2
  406.848238 913.436035 1
  408.010441 2608.300049 2
  413.497808 806.414185 1
  419.461579 751.900513 1
  422.062426 2543.683350 2
  424.879410 906.117432 1
  426.020086 6679.709961 6
  431.791261 1101.474609 1
  436.051974 1047.398682 1
  437.054925 893.514526 1
  442.067528 4436.766602 4
  442.911635 2759.521484 3
  443.950731 1321.732788 1
  443.970172 812.509399 1
  444.044411 6453.325195 6
  445.572214 841.594482 1
  452.022495 1937.461426 2
  457.480377 856.522949 1
  458.033633 1232.158569 1
  460.697305 788.837402 1
  464.048368 921.384644 1
  466.026404 2050.745361 2
  467.438038 866.393921 1
  469.082509 1624.410767 2
  469.943607 896.876587 1
  470.471429 869.188965 1
  472.997571 2965.099365 3
  474.005929 3340.461914 3
  475.981327 2309.196533 2
  476.769045 893.390015 1
  482.014169 1109.364136 1
  490.577927 865.671875 1
  495.986413 3573.079834 3
  503.995731 1348.502563 1
  505.942359 2912.094482 3
  513.950596 1574.987915 2
  517.969406 1224.442749 1
  521.571634 981.930542 1
  527.923614 1748.844971 2
  535.933739 1470.123901 1
  546.521458 937.347290 1
  555.264169 1045.011230 1
  555.961933 1088.883545 1
  558.898464 2764.403809 3
  564.438709 928.151001 1
  565.961903 986.175415 1
  577.527293 876.334473 1
  582.499322 1024.455933 1
  583.014947 1433.117676 1
  583.957596 898.550171 1
  585.271519 824.382202 1
  587.699999 858.872070 1
  588.959065 869.514648 1
  591.068327 1026.266724 1
  597.089487 1765.744385 2
  601.039767 1461.732910 1
  606.897839 830.464844 1
  607.044751 1456.613525 1
  609.019093 1749.500244 2
  609.982838 965.596191 1
  620.018584 1558.647583 1
  620.964712 813.986816 1
  629.026413 1757.375977 2
  629.993241 906.547119 1
  631.001229 1127.473511 1
  633.807559 841.758545 1
  638.027928 921.599121 1
  638.978971 1235.426025 1
  645.157175 735.909180 1
  658.155346 834.373413 1
  660.961939 1725.796875 2
  665.989101 859.190186 1
  666.560966 853.176636 1
  667.553729 832.653442 1
  671.454989 918.473267 1
  700.121540 888.605713 1
  710.440049 785.590210 1
  732.237336 816.913208 1
  732.368376 931.549561 1
  742.068353 1967.615479 2
  745.409895 989.389648 1
  750.297696 904.946045 1
  762.063444 1114.782349 1
  766.105670 6944.319824 7
  774.270925 869.359619 1
  777.820286 859.240967 1
  784.041926 1800.626709 2
  800.912737 898.264160 1
  808.116724 4549.406250 4
  809.120249 2552.125244 2
  819.019963 1286.542480 1
  825.976633 970.457764 1
  827.787018 929.337769 1
  828.511937 887.961548 1
  830.104693 923.344238 1
  834.445910 889.038086 1
  839.933136 1073.535034 1
  846.483453 881.927246 1
  848.469097 1037.246826 1
  855.937615 830.619385 1
  861.027232 1304.043823 1
  895.667050 828.392944 1
  896.706138 800.641113 1
  904.786028 863.764404 1
  905.980119 2960.272461 3
  907.703353 819.617676 1
  916.587672 978.710083 1
  937.555311 904.647705 1
  949.403337 836.129150 1
  958.000255 845.683228 1
  960.503678 882.715454 1
  963.016927 831.037231 1
  973.289675 942.236084 1
  1005.969235 13618.101563 13
  1006.970641 2793.869141 3
  1021.111784 913.417114 1
  1030.190815 848.667480 1
  1038.758667 905.543701 1
  1040.982369 836.972168 1
  1049.627657 999.137329 1
  1065.165989 1284.067383 1
  1068.424559 989.625122 1
  1086.207564 966.634155 1
  1087.514093 1110.187744 1
  1092.750203 871.434937 1
  1105.965432 18513.230469 18
  1106.966746 3217.297119 3
  1109.727383 893.187378 1
  1134.748531 846.188965 1
  1142.924285 810.052612 1
  1155.057865 1088.279907 1
  1155.955800 1206.970337 1
  1165.985321 13408.233398 13
  1166.986407 3703.663574 4
  1176.199286 909.901611 1
  1181.023037 840.102783 1
  1182.973150 2738.166992 3
  1197.049651 1021.557983 1
  1205.956640 9825.048828 9
  1206.962121 2422.732666 2
  1217.616090 1020.088257 1
  1239.887600 990.177246 1
  1242.365856 773.481323 1
  1242.398949 982.623535 1
  1246.895388 993.037598 1
  1250.087496 1196.791016 1
  1250.204411 1246.747192 1
  1254.491452 860.262451 1
  1255.692748 915.884155 1
  1255.944988 5332.255371 5
  1256.954705 1236.502319 1
  1257.940352 952.318359 1
  1258.918720 867.514526 1
  1263.657969 862.066895 1
  1265.978062 32070.916016 31
  1266.982865 10179.546875 10
  1267.980333 1185.097900 1
  1273.783794 973.621826 1
  1276.450576 910.897827 1
  1278.503663 891.517578 1
  1280.405883 935.708496 1
  1282.971940 7073.545410 7
  1283.979661 2139.933838 2
  1294.509600 784.771973 1
  1305.953902 1256.752930 1
  1313.323194 963.960693 1
  1333.966349 2269.072266 2
  1350.081373 917.804321 1
  1355.948671 2604.844482 2
  1365.974981 21960.000000 21
  1366.977040 5454.978516 5
  1378.246835 919.187622 1
  1381.267894 883.165161 1
  1381.607414 774.591919 1
  1382.966749 4520.511230 4
  1383.958384 1107.741333 1
  1387.847694 936.249512 1
  1390.861192 1032.898682 1
  1391.145436 984.267822 1
  1395.784027 857.185791 1
  1419.419624 1225.516968 1
  1433.968261 1436.810547 1
  1438.843481 966.967529 1
  1443.557068 939.432373 1
  1449.168964 944.486816 1
  1454.038170 827.550781 1
  1455.033830 1339.929688 1
  1465.820633 1017.776001 1
  1465.958479 10428.365234 10
  1466.966411 3373.382324 3
  1469.900620 934.335205 1
  1482.955151 2735.889160 3
  1495.976643 881.445557 1