ACCESSION: MSBNK-NAIST-KNA00660
RECORD_TITLE: L-Tyrosine; LC-ESI-ITFT; MS; NEG
DATE: 2016.01.19 (Created 2009.11.19, modified 2011.08.03)
AUTHORS: Takahashi H, Kanaya S, Ogasawara N, Graduate School of Information Science, NAIST
LICENSE: CC BY-SA

CH$NAME: L-Tyrosine
CH$NAME: (S)-3-(p-Hydroxyphenyl)alanine
CH$NAME: (S)-2-Amino-3-(p-hydroxyphenyl)propionic acid
CH$NAME: Tyrosine
CH$COMPOUND_CLASS: Natural Product
CH$FORMULA: C9H11NO3
CH$EXACT_MASS: 181.07389
CH$SMILES: OC(=O)C(N)Cc(c1)ccc(O)c1
CH$IUPAC: InChI=1S/C9H11NO3/c10-8(9(12)13)5-6-1-3-7(11)4-2-6/h1-4,8,11H,5,10H2,(H,12,13)/t8-/m0/s1
CH$LINK: CAS 60-18-4
CH$LINK: CHEBI 17895
CH$LINK: KEGG C00082
CH$LINK: KNAPSACK C00001397
CH$LINK: NIKKAJI J9.173A
CH$LINK: PUBCHEM 3382
CH$LINK: INCHIKEY OUYCCCASQSFEME-QMMMGPOBSA-N
CH$LINK: COMPTOX DTXSID1023730

AC$INSTRUMENT: LTQ Orbitrap XL, Thermo Scientfic
AC$INSTRUMENT_TYPE: LC-ESI-ITFT
AC$MASS_SPECTROMETRY: MS_TYPE MS
AC$MASS_SPECTROMETRY: ION_MODE NEGATIVE
AC$MASS_SPECTROMETRY: COLLISION_ENERGY 35eV
AC$MASS_SPECTROMETRY: IONIZATION ESI
AC$CHROMATOGRAPHY: COLUMN_NAME TOSOH TSKgel ODS-100V 5um Part no. 21456
AC$CHROMATOGRAPHY: FLOW_GRADIENT 0min:3%, 45min:97%, 50min:97%, 50.1:3%, 57min:3% (acetonitrile)
AC$CHROMATOGRAPHY: FLOW_RATE 0.5 ml/min
AC$CHROMATOGRAPHY: RETENTION_TIME 5.734167 min
AC$CHROMATOGRAPHY: SOLVENT A 0.1%formate-water
AC$CHROMATOGRAPHY: SOLVENT B 0.1%formate-acetonitrile

MS$FOCUSED_ION: BASE_PEAK 180.066605

PK$SPLASH: splash10-001i-0848491200-6fe1b2b20c4a63952f81
PK$NUM_PEAK: 684
PK$PEAK: m/z int. rel.int.
  100.957929 860.908508 2
  102.890839 731.888489 1
  103.430470 697.968445 1
  103.920096 1167.085205 2
  104.510232 790.235901 1
  106.056022 772.929626 1
  106.606843 811.604675 2
  107.050135 1698.175049 3
  107.147506 1147.377686 2
  107.271454 841.780579 2
  107.603035 780.839539 1
  107.702007 741.549866 1
  108.908124 762.450012 1
  110.123698 857.093933 2
  110.192069 957.012756 2
  112.366495 667.359985 1
  112.985648 55810.691406 105
  113.857652 735.407166 1
  114.279785 732.343567 1
  114.686169 792.222595 1
  114.951389 1904.837646 4
  117.980895 834.674500 2
  118.151771 783.757385 1
  119.015176 740.263123 1
  119.050017 5957.621582 11
  120.255479 826.495178 2
  121.171316 908.989441 2
  122.412038 718.207581 1
  123.129855 915.055481 2
  126.238666 952.621277 2
  128.649298 846.537170 2
  131.687178 760.228821 1
  133.013878 899.818176 2
  134.047025 3172.867920 6
  135.005971 778.911194 1
  136.086151 787.171082 1
  136.408248 839.590759 2
  137.287172 875.670593 2
  139.006887 18981.435547 36
  142.171483 837.773376 2
  145.187571 954.664490 2
  145.890482 2549.786133 5
  146.898436 923.996643 2
  146.965735 3638.385742 7
  147.029711 909.046814 2
  147.892403 1341.405273 3
  148.580507 835.691589 2
  148.952461 4553.582031 9
  153.214105 835.587585 2
  156.915173 850.319031 2
  158.924781 2950.866211 6
  159.193492 796.041931 2
  159.893276 1112.150879 2
  159.895950 812.074646 2
  160.841743 1681.769775 3
  160.892241 1120.857422 2
  161.104901 1060.660156 2
  162.838737 1055.562744 2
  163.039536 10929.570313 21
  163.901943 964.477112 2
  164.042770 1172.823486 2
  164.684133 820.431580 2
  166.806242 811.342102 2
  167.599910 746.993958 1
  169.587969 930.541443 2
  170.338997 921.354309 2
  170.951355 774.668030 1
  172.987057 750.402161 1
  174.186971 708.044739 1
  174.286911 847.208801 2
  176.034873 741.825623 1
  178.032107 695.785095 1
  178.354780 812.157654 2
  178.976976 901.354309 2
  180.024728 1106.640625 2
  180.051199 1556.956543 3
  180.054851 2734.832031 5
  180.058959 5358.594238 10
  180.060785 1936.435303 4
  180.062611 12435.088867 23
  180.066719 528986.500000 999
  180.070828 10861.059570 21
  180.072198 1438.510498 3
  180.074480 5640.287109 11
  180.077676 2134.783936 4
  180.078589 2031.705566 4
  180.081785 1304.520020 2
  180.108726 1651.581787 3
  180.116489 812.618469 2
  180.192783 1002.454285 2
  181.069277 29221.664063 55
  181.714074 792.697815 1
  181.725645 836.501526 2
  181.816394 944.821838 2
  182.070484 1092.434570 2
  184.342673 1838.720947 3
  187.215878 804.374329 2
  189.404013 880.856262 2
  189.501561 832.648254 2
  189.924646 752.414368 1
  189.995381 3262.932373 6
  191.016259 964.375549 2
  191.019252 8127.352051 15
  193.954102 824.661804 2
  195.050321 1967.510986 4
  195.186777 750.756165 1
  196.060909 1647.247559 3
  197.962578 906.062805 2
  199.263482 811.327209 2
  200.369178 921.283020 2
  202.047772 12296.167969 23
  204.030818 771.364929 1
  205.082681 701.505676 1
  212.830150 1007.958801 2
  213.531708 913.136902 2
  213.998188 870.771057 2
  216.032973 3733.716309 7
  216.037772 3057.684570 6
  216.039572 2443.791748 5
  216.042572 128616.304688 243
  216.046171 3028.203369 6
  216.047971 2657.574463 5
  216.053371 1610.770996 3
  217.045557 9343.157227 18
  217.294067 776.399109 1
  218.022088 1248.251465 2
  218.034253 1236.331055 2
  218.039727 38292.847656 72
  219.042582 3184.864258 6
  220.140588 717.889954 1
  220.974796 1155.941162 2
  221.450948 760.243591 1
  225.098458 14885.662109 28
  225.145682 917.428528 2
  225.415908 1102.025879 2
  225.794916 786.798035 1
  226.070808 1588.376709 3
  226.143394 756.875793 1
  229.885546 814.090637 2
  229.964589 717.590149 1
  230.066087 1804.265869 3
  230.365040 769.760437 1
  232.008056 1733.780029 3
  232.055467 868.818787 2
  232.932181 966.570618 2
  234.914030 940.477600 2
  234.992277 903.662537 2
  236.000735 1599.151611 3
  238.019185 1106.883545 2
  238.024041 18524.585938 35
  239.027661 1240.276855 2
  240.021482 5270.863770 10
  240.869593 1140.320557 2
  241.885597 905.227356 2
  243.061181 13871.171875 26
  244.065162 1001.908264 2
  246.061246 1075.281982 2
  248.053128 3977.957275 8
  251.995984 6823.197266 13
  256.958722 751.557556 1
  260.003416 1229.025391 2
  264.018453 2928.113525 6
  265.043470 22619.646484 43
  266.046590 2786.842285 5
  269.961461 12857.067383 24
  269.965651 895.669983 2
  270.035221 935.579163 2
  270.446489 935.919250 2
  270.969901 2261.980713 4
  271.328413 807.455627 2
  271.958581 4791.323242 9
  272.049269 821.635071 2
  272.670892 781.506775 1
  272.956090 2059.931641 4
  278.013784 1630.738525 3
  279.990416 9568.318359 18
  280.858993 4345.973633 8
  280.862550 880.883118 2
  280.998660 3460.285645 7
  281.919329 829.365173 2
  286.389700 752.816956 1
  287.991481 890.574280 2
  287.998868 1346.575928 3
  292.079741 1397.165527 3
  294.056061 5683.972656 11
  296.034222 2161.918213 4
  300.011628 1662.016602 3
  303.023603 4759.052246 9
  305.020620 2108.210449 4
  305.938563 29998.527344 57
  306.009346 3362.545654 6
  306.937855 999.767639 2
  306.941919 1683.281494 3
  307.000854 2231.688477 4
  307.112675 757.812073 1
  307.616625 863.724182 2
  307.934904 15172.455078 29
  307.940009 1210.973633 2
  308.006381 1068.673828 2
  308.688701 809.036926 2
  308.938872 995.094788 2
  309.932293 3102.688721 6
  310.023029 1434.975098 3
  310.254174 839.542419 2
  311.061073 811.107849 2
  311.167860 1127.021484 2
  312.131426 891.099548 2
  313.413722 804.863220 2
  313.932217 3148.062500 6
  315.929979 4211.075195 8
  315.967115 1950.291016 4
  316.323954 799.625305 2
  318.334969 813.661072 2
  319.957188 3713.311279 7
  320.061017 1378.105225 3
  321.048826 1490.031738 3
  321.862225 900.948914 2
  321.942971 744.859314 1
  321.956068 1392.871338 3
  322.869352 1042.003174 2
  322.955960 3757.859863 7
  323.955009 4685.165527 9
  324.955381 1371.295410 3
  325.955947 8103.342285 15
  325.995976 2659.938477 5
  327.311036 745.726624 1
  327.957526 4029.400635 8
  328.043944 2386.452637 5
  330.042159 3831.765869 7
  331.952395 1248.561768 2
  331.961537 981.165100 2
  332.038111 932.561096 2
  332.956779 1830.743408 3
  334.003782 1190.168457 2
  336.885858 1916.214111 4
  338.872404 742.399109 1
  340.059982 854.640320 2
  342.763054 1199.208496 2
  344.978562 1771.115723 3
  346.054849 3677.932617 7
  349.277104 756.405579 1
  351.648349 973.111023 2
  357.087724 1274.502441 2
  359.080995 761.173767 1
  359.124708 1510.053711 3
  359.223734 805.308655 2
  359.977416 845.342346 2
  361.106559 1287.865967 2
  361.119524 2756.057129 5
  361.128600 4148.936035 8
  361.138973 242853.171875 459
  361.150643 3831.944580 7
  361.162313 2055.072998 4
  362.020991 894.672913 2
  362.127728 1266.051758 2
  362.143351 38449.730469 73
  363.141466 1462.465820 3
  363.146696 1970.002441 4
  364.856315 849.041443 2
  366.998747 1359.294922 3
  374.071654 1655.792236 3
  375.736598 806.699768 2
  378.895092 1492.185547 3
  382.529982 774.088806 1
  383.098848 1320.165771 2
  383.108765 4006.982666 8
  383.121516 197727.171875 373
  383.130017 1524.885986 3
  383.134267 2363.928223 4
  383.145602 1498.182861 3
  384.113778 801.216736 2
  384.116623 778.005310 1
  384.125157 35285.832031 67
  385.038518 875.396667 2
  385.097050 27444.992188 52
  385.109900 922.680481 2
  385.128463 1365.442627 3
  385.893549 826.839661 2
  386.015315 978.452087 2
  386.101302 3885.308838 7
  391.978378 2875.802979 5
  391.984242 853.954773 2
  393.977098 1885.142090 4
  394.881364 897.859070 2
  394.891742 6350.671387 12
  394.977746 2822.340088 5
  395.222566 774.735535 1
  395.622185 893.077698 2
  395.976257 3123.399902 6
  396.049213 997.296204 2
  396.977064 1781.852295 3
  397.116074 2456.911133 5
  397.977170 5528.732910 10
  398.119708 941.349060 2
  399.086479 2189.837646 4
  399.095517 13186.033203 25
  399.443704 955.411072 2
  399.978175 1561.197021 3
  400.099109 2025.084229 4
  401.267418 867.360413 2
  402.009540 3792.879150 7
  403.933686 985.682190 2
  404.045677 4554.105469 9
  405.103439 12485.109375 24
  406.038576 978.817078 2
  406.106600 1018.006165 2
  408.010441 5771.385254 11
  410.002979 1875.695801 4
  411.090535 877.400452 2
  412.000668 1197.261963 2
  413.062878 2145.148193 4
  414.068703 951.654114 2
  415.059034 34100.906250 64
  416.067353 8145.677246 15
  416.746431 989.824524 2
  417.058432 2697.568848 5
  417.069696 1728.456787 3
  417.948105 770.575012 1
  421.077956 1259.253906 2
  423.066794 8170.656738 15
  423.567029 742.561584 1
  423.595028 810.061829 2
  424.071451 1309.778564 2
  426.021747 8991.805664 17
  426.848618 771.733948 1
  426.885275 790.823914 1
  429.115231 1747.866455 3
  430.117927 1221.859619 2
  431.102155 5908.507324 11
  431.110611 1000.623230 2
  431.354241 952.418762 2
  432.106735 1126.538574 2
  435.062757 1605.074463 3
  437.041116 1424.104004 3
  437.086000 1622.623779 3
  441.078783 2299.975586 4
  444.711635 819.518372 2
  445.092821 5674.137207 11
  446.096882 1205.655029 2
  446.175217 903.450745 2
  448.120599 1668.765625 3
  449.039633 3791.834717 7
  449.979529 3068.121094 6
  450.028225 2090.200684 4
  450.039047 1738.859375 3
  450.044459 982.034119 2
  451.034565 78941.781250 149
  452.038837 16967.525391 32
  453.031892 25975.355469 49
  453.914921 884.909363 2
  454.035534 3536.929688 7
  455.051686 1699.622070 3
  456.062051 1504.680420 3
  459.029796 3044.956787 6
  459.068818 1125.147705 2
  459.277020 801.096619 2
  460.055311 2068.795654 4
  461.026286 2950.942871 6
  461.063693 14064.675781 27
  461.114199 1477.564453 3
  462.067887 1105.108887 2
  463.024537 1776.615479 3
  465.092654 880.988464 2
  467.678711 1131.040283 2
  467.988421 1882.362793 4
  469.070993 4489.847168 8
  470.078367 1050.052734 2
  472.900410 998.726990 2
  473.017007 7558.942383 14
  474.021527 1639.970215 3
  475.013603 1474.413086 3
  475.129026 15768.415039 30
  476.132433 2503.864990 5
  477.107519 8851.452148 17
  478.054004 2504.140625 5
  478.111278 1652.090576 3
  481.085808 1684.536865 3
  481.153597 790.448547 1
  482.166157 842.088196 2
  483.019419 1274.602295 2
  483.045493 2856.742676 5
  483.063546 1385.157471 3
  491.987178 1172.510254 2
  492.034601 877.946228 2
  493.092062 973.050842 2
  494.998690 1583.517822 3
  495.088172 3957.661377 7
  496.092864 912.976135 2
  497.111086 1239.374756 2
  502.066692 3741.164063 7
  504.083387 1333.817627 3
  504.939769 1275.352783 2
  504.954775 1451.758301 3
  511.935729 4165.578613 8
  517.982770 825.124573 2
  520.380931 816.210266 2
  522.949390 1184.726074 2
  523.207055 829.271790 2
  525.851165 779.663391 1
  529.867744 833.302673 2
  529.925358 3110.754395 6
  529.946101 264262.125000 499
  529.959931 2048.329834 4
  529.966846 3714.142334 7
  529.985287 1236.393066 2
  530.947838 17582.132813 33
  531.950099 4301.492188 8
  533.893226 7043.388672 13
  540.052389 62817.722656 119
  540.073729 1035.147461 2
  540.510307 766.792053 1
  541.056774 8098.108887 15
  541.218497 1402.110596 3
  542.059195 957.210022 2
  542.214211 20697.103516 39
  543.217460 7512.006348 14
  544.216300 4124.858887 8
  547.217313 1667.530273 3
  547.955692 94881.125000 179
  548.960345 5894.030762 11
  549.220451 776.460876 1
  549.960453 1435.832031 3
  551.927238 3959.479736 7
  558.063134 1676.922363 3
  558.898464 1790.660889 3
  561.971567 1681.467773 3
  563.085707 903.500061 2
  563.300345 2041.415527 4
  564.137339 739.603699 1
  564.182909 3659.473877 7
  564.195568 1323.749268 2
  565.092928 734.966980 1
  565.186843 2111.669434 4
  565.923748 794.181824 1
  566.170551 10878.743164 21
  567.174693 2463.489990 5
  569.938331 3615.988770 7
  572.054710 790.047668 1
  575.949369 53456.128906 101
  576.953467 5497.942383 10
  577.954942 1212.946289 2
  579.897130 1371.763184 3
  580.161052 12554.275391 24
  580.224420 823.582947 2
  581.162953 4368.532715 8
  586.176745 14350.304688 27
  587.180836 2481.717285 5
  589.234603 836.680359 2
  591.076472 1552.958984 3
  593.970362 811.956604 2
  594.137229 6607.110352 12
  595.123449 11028.640625 21
  596.084630 889.376526 2
  596.109376 1369.643311 3
  596.131375 131862.921875 249
  596.150624 1489.395264 3
  596.156124 1485.256348 3
  597.136350 38765.562500 73
  597.931112 2174.341553 4
  598.130050 1936.136230 4
  598.141105 3828.197998 7
  600.127683 1231.393555 2
  603.144349 1234.477295 2
  603.959551 1038.937744 2
  604.127840 2135.007813 4
  604.141867 10152.916992 19
  604.902874 942.609802 2
  605.144675 1130.611816 2
  606.124607 1576.012451 3
  606.135885 809.199890 2
  608.287153 910.878357 2
  612.177530 16333.500000 31
  613.180339 5178.904297 10
  614.182738 1502.888916 3
  616.119795 1609.770508 3
  617.106242 1625.183594 3
  617.239493 798.630554 2
  618.115384 15668.460938 30
  619.118272 4172.665527 8
  620.018584 6360.406738 12
  624.125322 898.164001 2
  625.932087 8697.576172 16
  626.121483 3874.411377 7
  626.542012 940.797180 2
  627.188437 1027.302734 2
  631.100064 2031.343506 4
  632.269876 999.990417 2
  637.136733 1664.238770 3
  640.097330 4982.631348 9
  641.102073 1464.214600 3
  641.129675 896.873962 2
  650.051742 4256.979492 8
  650.684724 872.426575 2
  654.091041 4174.817383 8
  655.985134 829.940979 2
  656.086722 930.833069 2
  656.204212 1876.844727 4
  658.059656 1239.631836 2
  662.099904 27867.150391 53
  662.161064 5837.350586 11
  663.105295 5509.562012 10
  663.163368 1592.484619 3
  664.116211 7790.055664 15
  665.119719 2606.145996 5
  668.993092 1030.993896 2
  672.033911 1376.354492 3
  676.160552 3236.147217 6
  682.129221 1710.438477 3
  682.385101 970.218689 2
  684.139729 1516.047852 3
  688.757467 982.288879 2
  691.758847 955.927551 2
  692.357347 870.842834 2
  703.232822 1064.479980 2
  705.992615 760.278870 1
  710.279085 1058.479980 2
  710.959086 1046.545654 2
  711.019976 93966.164063 177
  712.023993 14610.247070 28
  713.022944 2688.002686 5
  718.434865 847.214050 2
  721.361582 848.365417 2
  728.504419 1012.229187 2
  733.001609 4151.293945 8
  734.003717 1701.181396 3
  737.287092 813.093201 2
  741.564482 998.633118 2
  742.068353 4464.860352 8
  743.073810 1044.764160 2
  747.243479 18653.023438 35
  748.247875 8203.693359 15
  749.250423 1374.808594 3
  751.907786 736.157288 1
  753.698950 775.644348 1
  754.982835 1785.560547 3
  757.245414 859.622986 2
  763.348847 991.222473 2
  766.374157 878.584900 2
  767.236672 909.159119 2
  769.223977 1359.314697 3
  774.201733 812.731140 2
  776.199835 11930.224609 23
  777.201789 4404.262695 8
  779.010200 967.899963 2
  781.064074 1115.038818 2
  783.213039 3236.590820 6
  784.149778 10348.544922 20
  785.150542 2369.581787 4
  789.231462 1171.148438 2
  791.208173 1068.214355 2
  792.538540 1011.028015 2
  795.870690 848.175354 2
  798.179073 1932.277344 4
  799.189749 8433.028320 16
  800.189516 2718.789063 5
  805.207970 1124.933838 2
  808.112384 1120.485596 2
  810.125644 853.241760 2
  819.019963 1076.422363 2
  830.113731 3226.443115 6
  834.883271 965.578796 2
  836.521870 924.712830 2
  841.074862 1029.001465 2
  843.175625 5082.356445 10
  843.744874 821.038391 2
  845.182129 1290.914307 2
  857.145328 1031.620117 2
  861.032005 903.107971 2
  862.116596 753.889099 1
  870.746202 836.307068 2
  882.029590 855.662048 2
  887.084441 1171.869385 2
  887.319097 933.084778 2
  892.092251 1742.807373 3
  905.980119 4671.976563 9
  914.076309 1964.053955 4
  932.278726 3562.559814 7
  933.279837 1368.475342 3
  959.632543 910.577209 2
  959.655009 720.602478 1
  967.339430 866.552917 2
  968.505744 1431.345215 3
  968.813320 791.053894 1
  978.982411 835.801331 2
  981.615066 805.489929 2
  986.285871 793.329163 1
  988.466428 913.553284 2
  993.695037 883.034729 2
  997.731585 826.052673 2
  1002.242223 1239.949219 2
  1002.284186 956.738098 2
  1005.921012 965.591492 2
  1005.969235 12478.419922 24
  1006.976678 3321.334717 6
  1011.732600 760.012634 1
  1011.744760 745.425110 1
  1026.042825 919.749207 2
  1027.852148 932.555237 2
  1030.890845 879.253723 2
  1042.182706 871.007751 2
  1044.487567 846.351379 2
  1049.550564 1112.485840 2
  1049.858985 1035.858398 2
  1065.271083 828.164734 2
  1070.188424 908.213318 2
  1076.426497 871.888367 2
  1080.541741 888.842834 2
  1080.628985 792.426331 1
  1082.638504 858.103333 2
  1087.575077 830.838562 2
  1102.658264 889.489685 2
  1105.340300 964.765442 2
  1105.965432 18569.210938 35
  1106.966746 4408.344727 8
  1107.412211 3153.230957 6
  1108.415492 1142.409180 2
  1113.557704 884.064514 2
  1128.570279 966.597961 2
  1142.493702 1041.243164 2
  1155.955800 1702.171143 3
  1160.625551 917.376038 2
  1163.312050 985.219666 2
  1163.881976 1053.813721 2
  1165.985321 13099.679688 25
  1166.993939 3473.536621 7
  1169.921809 847.396790 2
  1172.140112 780.805725 1
  1181.759520 890.016174 2
  1182.980837 1211.347656 2
  1187.954702 905.041077 2
  1190.278823 795.647156 2
  1195.759614 900.917542 2
  1205.956640 9780.440430 18
  1206.962121 2671.264893 5
  1207.810234 880.884583 2
  1207.960927 930.386047 2
  1225.829141 913.413391 2
  1228.802285 831.621399 2
  1233.969956 2256.117920 4
  1236.660506 981.951599 2
  1246.695768 1144.031250 2
  1247.552811 913.090881 2
  1255.491012 972.604309 2
  1255.953397 3345.083252 6
  1265.978062 32700.732422 62
  1266.982865 8329.111328 16
  1267.988864 2041.795898 4
  1282.971940 5899.071777 11
  1283.970969 1619.567871 3
  1292.172099 860.580750 2
  1298.955978 878.456116 2
  1305.944986 1600.689209 3
  1306.426603 908.081970 2
  1307.613946 873.114929 2
  1333.966349 5138.175293 10
  1334.979463 1217.847168 2
  1355.665715 918.270813 2
  1355.948671 3232.989258 6
  1356.949159 1356.718994 3
  1364.012236 1051.829590 2
  1365.974981 21815.498047 41
  1366.977040 6627.323730 13
  1367.980202 2377.368164 4
  1373.608750 1717.182373 3
  1382.966749 3796.817139 7
  1383.734687 813.447449 2
  1383.968112 1844.155762 3
  1398.645525 914.610901 2
  1403.897944 813.896545 2
  1410.250001 943.827332 2
  1417.501925 814.138489 2
  1433.958002 3659.149658 7
  1434.953645 2645.872803 5
  1451.945381 969.352844 2
  1455.936047 1837.723877 3
  1465.969084 11317.145508 21
  1466.966411 4775.172363 9
  1470.560965 1066.880859 2
  1482.696242 1061.393799 2
  1482.955151 2083.086426 4
  1484.121082 897.981873 2
  1484.618099 944.932068 2
  1487.843965 1307.846191 2
  1488.646649 983.724182 2