ACCESSION: MSBNK-NAIST-KNA00604
RECORD_TITLE: Acetyl-CoA; LC-ESI-ITFT; MS; NEG
DATE: 2016.01.19 (Created 2009.11.19, modified 2011.08.03)
AUTHORS: Takahashi H, Kanaya S, Ogasawara N, Graduate School of Information Science, NAIST
LICENSE: CC BY-SA

CH$NAME: Acetyl-CoA
CH$NAME: Acetyl coenzyme A
CH$COMPOUND_CLASS: Natural Product
CH$FORMULA: C23H38N7O17P3S
CH$EXACT_MASS: 809.12577
CH$SMILES: CC(=O)SCCNC(=O)CCNC(=O)C(O)C(C)(C)COP(O)(=O)OP(O)(=O)OCC(O1)C(OP(O)(O)=O)C(O)C1n(c2)c(n3)c(c(N)nc3)n2
CH$IUPAC: InChI=1S/C23H38N7O17P3S/c1-12(31)51-7-6-25-14(32)4-5-26-21(35)18(34)23(2,3)9-44-50(41,42)47-49(39,40)43-8-13-17(46-48(36,37)38)16(33)22(45-13)30-11-29-15-19(24)27-10-28-20(15)30/h10-11,13,16-18,22,33-34H,4-9H2,1-3H3,(H,25,32)(H,26,35)(H,39,40)(H,41,42)(H2,24,27,28)(H2,36,37,38)/t13-,16-,17-,18+,22-/m1/s1
CH$LINK: CAS 72-89-9
CH$LINK: CHEBI 15351
CH$LINK: KEGG C00024
CH$LINK: KNAPSACK C00007259
CH$LINK: NIKKAJI J192.549K
CH$LINK: PUBCHEM 3326
CH$LINK: INCHIKEY ZSLZBFCDCINBPY-ZSJPKINUSA-N

AC$INSTRUMENT: LTQ Orbitrap XL, Thermo Scientfic
AC$INSTRUMENT_TYPE: LC-ESI-ITFT
AC$MASS_SPECTROMETRY: MS_TYPE MS
AC$MASS_SPECTROMETRY: ION_MODE NEGATIVE
AC$MASS_SPECTROMETRY: COLLISION_ENERGY 35eV
AC$MASS_SPECTROMETRY: IONIZATION ESI
AC$CHROMATOGRAPHY: COLUMN_NAME TOSOH TSKgel ODS-100V 5um Part no. 21456
AC$CHROMATOGRAPHY: FLOW_GRADIENT 0min:3%, 45min:97%, 50min:97%, 50.1:3%, 57min:3% (acetonitrile)
AC$CHROMATOGRAPHY: FLOW_RATE 0.5 ml/min
AC$CHROMATOGRAPHY: RETENTION_TIME 13.801157 min
AC$CHROMATOGRAPHY: SOLVENT A 0.1%formate-water
AC$CHROMATOGRAPHY: SOLVENT B 0.1%formate-acetonitrile

MS$FOCUSED_ION: BASE_PEAK 808.117493

PK$SPLASH: splash10-0a4i-0311200190-ce18aca286792396e4c9
PK$NUM_PEAK: 665
PK$PEAK: m/z int. rel.int.
  107.034756 2382.076416 1
  107.036429 82748.085938 29
  107.038103 2919.413574 1
  108.039512 1465.259521 1
  112.985536 8942.435547 3
  114.951974 1924.817871 1
  118.033335 3683.279541 1
  120.969345 2254.682373 1
  133.966001 3324.853760 1
  134.019920 7972.713379 3
  134.026076 1655.078857 1
  134.027249 1512.612793 1
  134.030180 1619.518066 1
  134.031939 1646.917480 1
  134.033405 2627.938965 1
  134.036923 4032.168457 1
  134.039562 11347.864258 4
  134.043080 43511.480469 15
  134.044546 50523.652344 18
  134.045426 23074.638672 8
  134.046892 1454880.625000 507
  134.049238 46246.089844 16
  134.052170 14504.084961 5
  134.054223 8316.660156 3
  134.057155 3542.481201 1
  134.058621 2304.448242 1
  134.060381 2704.087158 1
  134.061554 1525.862305 1
  134.063020 1585.938965 1
  134.066539 2187.141113 1
  134.071819 1462.049805 1
  134.073872 7467.515137 3
  134.127856 2886.727783 1
  135.044076 15473.156250 5
  135.047931 2120.605225 1
  135.050303 59309.539063 21
  135.052675 2167.944092 1
  136.964244 2200.260742 1
  138.979815 2663.056152 1
  146.082286 3038.006348 1
  146.985110 4868.818359 2
  150.979942 3986.824707 1
  158.890179 1536.456055 1
  158.915534 2216.439697 1
  158.918941 3542.428223 1
  158.922347 14662.886719 5
  158.925375 392396.343750 137
  158.928404 12603.228516 4
  158.931810 4037.510742 1
  158.934460 2176.085449 1
  158.935217 2143.042236 1
  158.960205 1794.795654 1
  160.929484 3178.057617 1
  163.016169 17967.669922 6
  165.031894 1822.017334 1
  166.974713 2385.107422 1
  174.976497 3512.904297 1
  174.979995 132246.281250 46
  174.983931 2999.130371 1
  175.957954 13400.471680 5
  175.983093 4878.822266 2
  176.935687 28814.035156 10
  180.042364 2417.609619 1
  181.026771 35265.164063 12
  184.429073 1865.381104 1
  184.985394 1816.166504 1
  190.026882 3554.373291 1
  191.011101 16968.410156 6
  192.986409 1629.679688 1
  192.990461 59600.296875 21
  208.029182 1772.390381 1
  208.033150 2563.718506 1
  208.037685 73567.460938 26
  208.042221 1455.800293 1
  209.021349 4001.023438 1
  209.040762 3565.638184 1
  210.990034 1577.850342 1
  210.991771 1810.873779 1
  210.995824 3530.473389 1
  211.001035 134680.031250 47
  211.005668 3363.374268 1
  212.004067 3559.923096 1
  214.012777 5934.495117 2
  217.119078 1625.082520 1
  226.048124 4296.649902 1
  226.951046 1987.488770 1
  230.945915 1619.312256 1
  236.068346 3185.526855 1
  236.934844 1480.442871 1
  238.862755 6811.536621 2
  238.891354 5889.759766 2
  242.982224 10447.397461 4
  243.484630 7403.789063 3
  254.940096 1647.569092 1
  254.946249 69011.195313 24
  254.950863 1836.218018 1
  255.949009 2992.061035 1
  256.872893 8045.177246 3
  260.992913 14782.032227 5
  261.063825 2917.044189 1
  262.047622 4381.223145 2
  269.993042 3319.735596 1
  270.977219 6579.038574 2
  272.928560 2609.030029 1
  272.942190 1454.705322 1
  272.949858 6730.041992 2
  272.956674 276155.250000 96
  272.964342 6176.293457 2
  272.972011 2320.370361 1
  273.959685 8101.946777 3
  274.960482 4019.187500 1
  275.016482 1533.480713 1
  277.122354 2582.346924 1
  279.074498 11382.488281 4
  280.058315 5944.235352 2
  284.901797 1963.304932 1
  288.004138 2408.641357 1
  290.966981 54966.851563 19
  291.970101 1492.750000 1
  292.810792 1452.420166 1
  292.909267 3523.142578 1
  297.085658 3522.717041 1
  300.818022 6640.842285 2
  304.033391 1834.795898 1
  305.089794 15593.842773 5
  306.093022 1733.460693 1
  309.812460 1505.006348 1
  310.034087 6374.376465 2
  310.820455 2096.380859 1
  312.948510 2353.413330 1
  315.022423 21737.210938 8
  315.523738 1926.801025 1
  316.020943 2204.343506 1
  321.038742 5777.533691 2
  321.067000 6632.895508 2
  321.085478 3790.560059 1
  322.039820 1551.905029 1
  322.044188 2323.226563 1
  323.100444 6039.057617 2
  324.935154 1662.934814 1
  328.035776 1849.257813 1
  328.044757 92927.632813 32
  329.048359 8012.303223 3
  332.993198 1723.285889 1
  334.911780 11506.672852 4
  336.027370 10884.875000 4
  336.529514 2197.118164 1
  338.987613 5378.100586 2
  339.058375 1991.855957 1
  339.061913 2051.171387 1
  339.068991 5755.827637 2
  339.078428 363757.000000 127
  339.087865 7044.393555 2
  339.094944 4545.047852 2
  340.080987 36571.093750 13
  341.073718 10698.587891 4
  341.080858 3390.242188 1
  346.044796 1822.907471 1
  346.054526 116572.726563 41
  346.065472 1790.314453 1
  347.058887 7959.549316 3
  349.930092 1634.218018 1
  352.894683 2437.003174 1
  352.922239 27793.521484 10
  353.926476 2002.413574 1
  357.078473 3070.187744 1
  357.088672 211256.281250 74
  357.098871 4261.779297 1
  358.091553 17320.437500 6
  359.084524 5950.890625 2
  360.024836 1948.425781 1
  370.932329 1547.509521 1
  373.544258 2522.793213 1
  381.077872 3192.367920 1
  381.089116 167316.343750 58
  381.100361 3529.442627 1
  382.091832 21341.966797 7
  382.549434 44272.234375 15
  383.051764 8523.758789 3
  383.084344 6648.365723 2
  383.999680 7648.801758 3
  385.056736 6286.621582 2
  386.014974 2187.493652 1
  390.000304 6863.140625 2
  392.997559 2734.348633 1
  394.528406 2741.607178 1
  399.087623 2187.352295 1
  399.099674 117185.257813 41
  399.111725 1440.005859 1
  400.101769 14187.289063 5
  401.004457 12534.017578 4
  401.015077 6262.297852 2
  401.033284 7301.693848 3
  401.051492 4366.988770 2
  401.093983 4008.304688 1
  401.101572 1441.424316 1
  401.998511 2674.567139 1
  402.010693 156857.921875 55
  402.022876 3310.530029 1
  403.003908 2197.275879 1
  403.013079 15529.974609 5
  403.542479 2134.867432 1
  403.554732 57657.023438 20
  404.014615 1928.234131 1
  404.056043 11078.310547 4
  404.507562 12218.651367 4
  404.558289 1601.191895 1
  405.010650 4445.911621 2
  407.866842 1645.934326 1
  407.971131 1922.423828 1
  407.982029 2793.313477 1
  407.985143 2456.121094 1
  407.989814 2690.211914 1
  407.997599 8519.854492 3
  408.011612 553312.750000 193
  408.024069 10107.866211 4
  408.038084 3685.969238 1
  408.053657 2075.923584 1
  409.014659 55572.296875 19
  409.508959 2965.796875 1
  410.015136 4544.102539 2
  410.026116 4852.257324 2
  413.513299 3739.102783 1
  414.546284 1457.818359 1
  414.851028 3833.786133 1
  419.029770 2172.483643 1
  419.044356 121989.953125 42
  419.057322 1564.983887 1
  420.047723 12044.963867 4
  421.040008 4640.390137 2
  421.046537 2168.554932 1
  423.991862 5395.546387 2
  425.513437 4181.846680 1
  425.979812 1637.478760 1
  425.993101 4412.153809 2
  425.999746 1460.746094 1
  426.008052 7176.070313 3
  426.021342 440798.156250 154
  426.034633 7713.813477 3
  426.049585 2355.465088 1
  426.516843 1647.409180 1
  427.024878 44893.832031 16
  428.025273 6676.583008 2
  429.992834 7639.604004 3
  430.009680 2818.585205 1
  430.512158 2120.333496 1
  434.517668 9152.529297 3
  435.019499 1998.914063 1
  437.054529 28490.947266 10
  438.057482 2038.706543 1
  439.093442 4767.408691 2
  443.015163 2027.291504 1
  443.043352 5929.676270 2
  443.089163 8237.316406 3
  444.047554 1845.509033 1
  448.003732 14093.502930 5
  449.006880 1447.830078 1
  459.036830 1609.629150 1
  461.038978 4389.553223 2
  461.053940 213143.750000 74
  461.070774 3697.310059 1
  462.058102 17454.787109 6
  463.050487 5115.770996 2
  463.059900 2712.118652 1
  463.936552 1665.808838 1
  465.982279 2865.424561 1
  469.937412 11077.948242 4
  469.966284 3428.750732 1
  471.092432 4858.603516 2
  472.964109 1700.096924 1
  478.933561 3133.962158 1
  479.066264 65062.347656 23
  479.941105 9716.343750 3
  480.068265 4273.826172 1
  480.971759 2525.686768 1
  480.981723 1649.717285 1
  481.061451 2018.288330 1
  484.966288 2372.285645 1
  485.954479 2777.153809 1
  487.948091 20103.167969 7
  487.976602 25096.542969 9
  488.980143 1698.278076 1
  489.945801 1959.492188 1
  489.966291 2057.908203 1
  500.928946 1503.497803 1
  502.975011 1752.941162 1
  505.989196 14639.569336 5
  506.992758 1537.527832 1
  509.958321 3986.023438 1
  510.078007 7275.570801 3
  519.059736 13245.246094 5
  520.064359 2578.097168 1
  522.041810 1592.859375 1
  522.982793 2688.327881 1
  527.909369 2523.806152 1
  529.945604 2388.212158 1
  533.075597 17782.503906 6
  533.892726 4654.141113 2
  534.079229 2261.248047 1
  537.069562 8562.666992 3
  540.054254 10038.225586 3
  541.020603 1528.680420 1
  541.056268 1880.923096 1
  541.896588 3174.365967 1
  541.996700 9130.874023 3
  542.910905 2516.374268 1
  542.999345 1486.317627 1
  547.909139 3004.979248 1
  549.903901 26175.875000 9
  550.909033 3483.498535 1
  551.087415 7192.155762 3
  551.899777 2278.542969 1
  554.014925 1905.605713 1
  556.010951 14333.360352 5
  557.015496 2748.854004 1
  558.062614 4360.684082 2
  558.900440 15528.989258 5
  563.997608 8669.566406 3
  565.006122 1488.641846 1
  567.914963 11883.259766 4
  572.007652 8056.892090 3
  575.088032 13919.392578 5
  576.089878 3217.354248 1
  593.098328 3652.662842 1
  595.002230 2318.742676 1
  599.017640 2486.711914 1
  602.009187 3069.184082 1
  606.174800 1835.008057 1
  613.042101 2403.822021 1
  613.059308 1555.395508 1
  614.003918 1979.496826 1
  617.966771 4525.693848 2
  618.039336 1556.936768 1
  619.965516 1754.047119 1
  619.977182 2032.308350 1
  619.994682 3111.282471 1
  620.020932 180280.828125 63
  620.044268 2465.022705 1
  621.022616 20974.863281 7
  621.965183 1632.925781 1
  622.023798 5814.083496 2
  625.952225 2835.185791 1
  631.054559 18491.197266 6
  632.014062 1646.981201 1
  632.056090 2742.403076 1
  633.963770 2441.434326 1
  634.036155 2913.194580 1
  635.065960 1633.162598 1
  635.977054 4193.351563 1
  638.006032 2147.223877 1
  638.030390 146552.703125 51
  638.057794 2243.446533 1
  639.033320 19258.277344 7
  640.035558 3777.128418 1
  642.001017 2935.896973 1
  643.966282 6441.625000 2
  644.973962 1812.226074 1
  649.047172 2003.651123 1
  651.971741 4629.880371 2
  652.047232 10063.461914 4
  652.154199 1737.037842 1
  655.052302 1931.006836 1
  660.012070 5896.483887 2
  661.015919 2409.327148 1
  663.934572 1846.694580 1
  668.130268 1792.117188 1
  668.146583 1611.358398 1
  673.064712 24441.876953 9
  674.068739 3850.956055 1
  674.972298 2876.738037 1
  681.946883 1652.596191 1
  686.141541 50150.050781 17
  687.144353 7047.548828 2
  688.145955 1730.835693 1
  708.123229 6193.326660 2
  710.099662 6778.115234 2
  710.142564 5182.309082 2
  711.105313 1932.243896 1
  712.048482 8333.157227 3
  713.047486 2050.658203 1
  728.065606 2265.961426 1
  728.121283 2584.616943 1
  728.132419 1665.644043 1
  728.150980 175871.203125 61
  728.180678 1871.139893 1
  729.061325 2598.443848 1
  729.154314 28364.007813 10
  730.059088 17535.501953 6
  730.144813 2489.325195 1
  730.159723 5544.075684 2
  731.055167 2236.140869 1
  736.024770 1518.199951 1
  739.052150 13554.615234 5
  740.059089 5225.908203 2
  742.067693 159262.718750 55
  742.102066 1846.005615 1
  743.069322 27745.480469 10
  744.072981 4525.474609 2
  748.096422 2514.411621 1
  748.115752 3481.033447 1
  764.049945 3584.169189 1
  766.072944 4622.428223 2
  766.108999 360547.343750 126
  766.141050 4426.490234 2
  766.177109 1854.068848 1
  767.111542 62362.234375 22
  768.099966 5300.618652 2
  768.116054 8033.766113 3
  769.106421 1820.602783 1
  770.074480 2160.280518 1
  771.072684 2437.060791 1
  772.068776 21962.960938 8
  773.070861 6856.478516 2
  774.062692 2274.424072 1
  775.105355 2994.572998 1
  777.078311 2162.140625 1
  781.063386 7193.712891 3
  786.156697 43642.371094 15
  787.161308 11356.937500 4
  788.088422 23177.970703 8
  788.167845 2128.350098 1
  789.059049 12385.541992 4
  789.092551 4376.754883 2
  789.561801 7184.598633 3
  790.069230 4612.040527 2
  790.111188 13141.111328 5
  791.114983 3631.398193 1
  792.015402 5997.619629 2
  799.035405 11407.953125 4
  799.539181 7926.588379 3
  800.034883 3705.366455 1
  801.010538 1539.082031 1
  802.018016 2092.417480 1
  803.539257 1874.732666 1
  803.995612 1518.734863 1
  804.055914 2480.218018 1
  806.919447 2655.322510 1
  807.716865 6168.389160 2
  807.738550 1451.148682 1
  807.807950 1675.334961 1
  807.912065 2387.989258 1
  807.929420 2507.556396 1
  807.955453 2250.022217 1
  807.964131 2828.216553 1
  807.981487 3085.415039 1
  808.007523 9069.000000 3
  808.046578 11353.118164 4
  808.059597 7115.061035 2
  808.081296 38626.117188 13
  808.116017 2867548.750000 999
  808.155080 37689.351563 13
  808.176784 2500.070557 1
  808.194147 13718.782227 5
  808.207169 3664.597168 1
  808.220192 6083.745117 2
  808.233216 7392.350098 3
  808.254922 1548.942383 1
  808.267946 3177.703125 1
  808.289654 2080.956299 1
  808.315704 2623.006348 1
  808.333072 1677.791992 1
  808.515465 6488.056152 2
  808.576277 1610.070801 1
  808.997803 1570.327637 1
  809.010845 2053.819336 1
  809.036930 3455.317871 1
  809.049973 3370.458740 1
  809.080408 13137.947266 5
  809.097800 6302.739258 2
  809.119542 795529.937500 277
  809.158678 9113.961914 3
  809.197817 3426.400635 1
  809.223911 2034.154785 1
  809.236959 2150.013428 1
  809.315251 2218.631104 1
  809.571955 3179.938477 1
  810.024748 22532.126953 8
  810.072662 4467.687500 2
  810.124936 123661.718750 43
  810.164146 1649.947754 1
  811.031831 4067.257324 1
  811.114748 14527.297852 5
  811.132206 11227.890625 4
  812.115121 4027.093750 1
  814.068763 2611.472656 1
  816.703713 4202.254883 1
  817.034532 3469.595947 1
  819.019249 27899.507813 10
  819.994356 2219.812256 1
  820.025411 12776.411133 4
  820.096400 4614.426758 2
  820.495884 1447.941406 1
  820.598021 3630.618408 1
  820.997872 3968.395020 1
  821.028984 3665.631348 1
  821.095658 1887.783936 1
  821.495873 4883.992188 2
  822.092290 1504.170166 1
  822.488777 1685.899170 1
  822.707190 2661.461914 1
  824.041843 1790.965820 1
  824.108885 1455.372559 1
  828.033834 3070.014893 1
  829.002541 2170.786865 1
  829.074699 3383.243164 1
  829.503330 2552.427490 1
  829.580067 4179.453613 1
  830.000055 15501.041992 5
  830.076861 38933.750000 14
  830.099453 246894.687500 86
  830.135603 2878.689453 1
  830.501748 12380.412109 4
  830.578624 19604.095703 7
  831.003896 5513.500000 2
  831.076315 8787.627930 3
  831.103475 51036.937500 18
  831.501970 1564.747559 1
  831.578985 2264.291992 1
  832.077575 49061.554688 17
  832.109319 7682.200684 3
  833.076103 9959.262695 3
  834.021820 7908.955566 3
  834.094634 11520.419922 4
  834.572714 10511.458984 4
  835.074000 7730.823730 3
  835.096796 2367.218994 1
  835.575738 3608.371094 1
  838.008718 7994.155762 3
  838.072888 2465.658691 1
  838.508517 8369.546875 3
  838.577331 2012.726807 1
  839.004171 28889.216797 10
  839.509455 22296.935547 8
  840.005997 10188.348633 4
  840.507583 5121.635254 2
  841.005011 2762.058350 1
  841.064917 2028.564941 1
  841.120219 2054.147949 1
  841.572064 1558.041992 1
  842.010425 2720.318848 1
  842.065821 1840.578125 1
  842.088904 1730.195313 1
  846.064110 5835.610352 2
  847.064639 2372.475586 1
  848.113605 1471.718506 1
  849.099074 2494.185547 1
  849.599471 2044.795410 1
  850.001980 2231.789551 1
  850.039437 13243.083008 5
  850.086262 14041.481445 5
  851.042337 19228.857422 7
  851.089245 3011.030029 1
  851.995327 3996.792480 1
  852.032916 194876.203125 68
  852.065809 3424.902100 1
  852.084605 9369.722656 3
  852.108102 140401.062500 49
  852.145698 1526.904541 1
  853.039347 50508.308594 18
  853.109958 29709.296875 10
  853.505543 1450.453125 1
  853.990980 1801.809814 1
  854.028701 12888.783203 4
  854.118299 4383.187012 2
  855.029224 3188.743652 1
  855.043395 2823.212646 1
  856.040970 1661.023193 1
  856.533308 2185.075928 1
  857.035552 2440.355469 1
  858.079355 2194.048096 1
  858.141094 2822.190918 1
  858.582959 4196.112793 1
  859.034679 4435.758789 2
  859.077492 14207.237305 5
  859.581976 14302.210938 5
  860.082138 7015.764160 2
  860.577967 2548.287598 1
  861.031263 92274.976563 32
  862.034557 32676.796875 11
  863.020445 2481.642578 1
  863.039605 7738.372070 3
  863.576350 3923.388184 1
  864.036815 3238.731445 1
  864.075204 2012.994385 1
  865.675408 1518.482910 1
  866.002723 2141.125244 1
  866.017168 1595.444580 1
  866.046058 2465.588135 1
  866.079765 10699.125000 4
  866.123106 726010.375000 253
  866.161634 8503.376953 3
  866.204981 3456.324951 1
  866.253148 2074.085938 1
  867.077427 2118.492676 1
  867.101547 2288.814453 1
  867.125667 171983.140625 60
  867.164262 2168.048096 1
  868.047822 3790.980469 1
  868.115472 12473.130859 4
  868.129970 26234.511719 9
  869.048887 3795.081543 1
  869.121495 5108.676758 2
  870.003201 1636.455078 1
  870.046837 45593.988281 16
  870.134118 1610.770508 1
  871.046506 11440.698242 4
  872.043034 2852.889648 1
  874.090049 7418.706543 3
  876.065891 2671.957031 1
  881.039848 1899.751465 1
  883.014528 1713.151367 1
  888.102864 41898.527344 15
  888.588092 1945.506836 1
  889.108778 14708.302734 5
  890.031114 2413.868408 1
  890.081282 32576.593750 11
  891.085535 7692.756836 3
  892.026049 5276.083496 2
  892.101556 1897.117676 1
  893.028554 2674.343750 1
  896.025959 4671.474609 2
  897.009837 1516.224121 1
  904.065827 2307.466553 1
  905.021829 4820.627930 2
  908.043681 4874.022461 2
  909.047425 5883.977539 2
  910.042460 50651.894531 18
  910.083956 2510.552979 1
  911.044326 18872.509766 7
  912.032235 3221.750000 1
  912.047846 5764.484863 2
  913.042601 1683.934326 1
  917.037939 1751.717529 1
  919.034922 28535.781250 10
  920.035860 11783.248047 4
  920.072768 1745.601563 1
  921.033154 2124.260498 1
  928.070518 1618.015381 1
  931.998346 2381.173096 1
  932.999005 1574.837158 1
  933.995884 1824.558594 1
  942.023291 1566.008301 1
  950.032911 2029.084229 1
  964.050195 2101.524658 1
  966.140369 2198.129639 1
  990.099884 14951.012695 5
  991.101262 5184.595215 2
  1005.974429 7613.241699 3
  1105.971489 7573.241211 3
  1165.976874 2046.575684 1
  1165.999441 1815.680420 1
  1166.993014 1579.922363 1
  1205.963608 3405.311523 1
  1226.063369 1473.237549 1
  1226.566402 2279.060791 1
  1243.557095 1805.034424 1
  1244.062643 1755.847656 1
  1244.568499 1672.579346 1
  1265.985598 8749.460938 3
  1266.990410 3816.963379 1
  1365.983499 8253.421875 3
  1366.985568 1966.308350 1
  1382.965721 1561.945068 1
  1465.978627 2966.133545 1
  1466.986580 1755.684326 1