ACCESSION: MSBNK-NAIST-KNA00491
RECORD_TITLE: L-Glutamine; LC-ESI-ITFT; MS; NEG
DATE: 2016.01.19 (Created 2009.11.18, modified 2011.08.03)
AUTHORS: Takahashi H, Kanaya S, Ogasawara N, Graduate School of Information Science, NAIST
LICENSE: CC BY-SA

CH$NAME: L-Glutamine
CH$NAME: L-2-Aminoglutaramic acid
CH$COMPOUND_CLASS: Natural Product
CH$FORMULA: C5H10N2O3
CH$EXACT_MASS: 146.06914
CH$SMILES: NC(=O)CC[C@H](N)C(O)=O
CH$IUPAC: InChI=1S/C5H10N2O3/c6-3(5(9)10)1-2-4(7)8/h3H,1-2,6H2,(H2,7,8)(H,9,10)/t3-/m0/s1
CH$LINK: CAS 56-85-9
CH$LINK: CHEBI 18050
CH$LINK: KEGG C00064
CH$LINK: KNAPSACK C00001359
CH$LINK: NIKKAJI J9.170G
CH$LINK: PUBCHEM 3364
CH$LINK: INCHIKEY ZDXPYRJPNDTMRX-VKHMYHEASA-N
CH$LINK: COMPTOX DTXSID1023100

AC$INSTRUMENT: LTQ Orbitrap XL, Thermo Scientfic
AC$INSTRUMENT_TYPE: LC-ESI-ITFT
AC$MASS_SPECTROMETRY: MS_TYPE MS
AC$MASS_SPECTROMETRY: ION_MODE NEGATIVE
AC$MASS_SPECTROMETRY: COLLISION_ENERGY 35eV
AC$MASS_SPECTROMETRY: IONIZATION ESI
AC$CHROMATOGRAPHY: COLUMN_NAME TOSOH TSKgel ODS-100V 5um Part no. 21456
AC$CHROMATOGRAPHY: FLOW_GRADIENT 0min:3%, 45min:97%, 50min:97%, 50.1:3%, 57min:3% (acetonitrile)
AC$CHROMATOGRAPHY: FLOW_RATE 0.5 ml/min
AC$CHROMATOGRAPHY: RETENTION_TIME 4.706115 min
AC$CHROMATOGRAPHY: SOLVENT A 0.1%formate-water
AC$CHROMATOGRAPHY: SOLVENT B 0.1%formate-acetonitrile

MS$FOCUSED_ION: BASE_PEAK 145.061432

PK$SPLASH: splash10-0002-0933201000-1bb2dd874f8c3ad45008
PK$NUM_PEAK: 556
PK$PEAK: m/z int. rel.int.
  100.623372 1075.738647 1
  101.072058 16400.162109 18
  102.055961 1455.783569 2
  103.920096 5109.926270 6
  104.525171 878.031250 1
  107.391412 790.583740 1
  107.829880 793.774658 1
  108.684506 1033.656372 1
  109.036646 789.959717 1
  109.040733 4175.194336 5
  109.940961 743.172852 1
  110.432416 771.049683 1
  110.963823 799.345337 1
  112.964776 751.932739 1
  112.983832 2671.006104 3
  112.985421 60616.808594 68
  112.987236 971.563477 1
  113.988828 927.609009 1
  114.951622 6470.051270 7
  115.042254 825.339478 1
  116.773143 750.406616 1
  116.920856 878.770630 1
  117.090390 712.477173 1
  118.009228 973.190674 1
  118.160021 765.411621 1
  120.018142 756.575684 1
  123.197255 892.746094 1
  123.267039 718.278198 1
  123.951717 857.857422 1
  123.952500 777.639526 1
  124.024491 711.727539 1
  126.667439 842.902222 1
  127.034536 856.143921 1
  127.046980 1042.825317 1
  127.048333 2086.704834 2
  127.049686 798.933594 1
  127.051039 40113.398438 45
  127.701525 789.378418 1
  127.780902 768.841187 1
  128.035075 15517.517578 17
  128.054237 1271.278320 1
  129.038066 1091.958130 1
  129.282948 771.793091 1
  131.938498 1104.030151 1
  132.029596 1265.557373 1
  136.450398 740.568726 1
  137.802837 821.391602 1
  139.006578 1753.456299 2
  139.508619 682.958252 1
  140.813088 748.978149 1
  141.967688 823.167358 1
  143.889470 1385.179443 2
  144.970334 1818.284668 2
  145.031032 4967.195801 6
  145.032682 788.061035 1
  145.035322 1260.361938 1
  145.049843 1771.244385 2
  145.052813 4251.060059 5
  145.054464 2428.435547 3
  145.056774 53533.214844 60
  145.058754 20080.550781 22
  145.061395 894443.375000 999
  145.064036 17963.164063 20
  145.066016 3317.064697 4
  145.067337 9120.051758 10
  145.070308 5040.439941 6
  145.071628 965.035645 1
  145.072949 2055.987305 2
  145.074600 2172.708984 2
  145.076250 761.919922 1
  145.079882 1386.739746 2
  145.085495 864.553955 1
  145.091768 4867.390137 5
  145.152873 2029.171875 2
  145.890149 951.887573 1
  146.045414 4329.166016 5
  146.058420 3177.783691 4
  146.061755 1237.618042 1
  146.064756 38215.769531 43
  146.067424 1599.373779 2
  147.065422 4257.646973 5
  147.674155 783.051880 1
  147.988273 799.302734 1
  149.410313 756.643066 1
  151.982923 1185.440308 1
  153.959215 878.416260 1
  156.866165 819.418823 1
  156.894750 1579.380493 2
  159.776834 1078.684814 1
  159.893276 802.360474 1
  160.935048 731.624756 1
  164.567206 1113.881470 1
  166.984661 787.599121 1
  167.043382 1087.282227 1
  167.979742 836.387451 1
  168.013887 682.692017 1
  168.014710 681.665771 1
  169.019442 3041.954346 3
  169.977513 1474.693726 2
  171.034999 3835.279785 4
  171.993237 2775.097900 3
  173.104037 1438.603149 2
  174.427842 822.091309 1
  174.894042 810.628052 1
  174.917641 1159.158325 1
  177.982749 1153.234375 1
  178.529064 1056.990723 1
  178.993263 4235.818848 5
  179.977276 928.310059 1
  181.037979 7465.079102 8
  181.040280 661.561401 1
  181.899796 868.881958 1
  181.974442 908.808716 1
  181.975834 893.501465 1
  183.035096 1551.073608 2
  183.462988 776.232910 1
  183.497735 849.207520 1
  183.969674 10837.199219 12
  183.992305 1442.343262 2
  184.529124 1908.038818 2
  186.045835 1221.462402 1
  187.029690 3567.222900 4
  188.013575 958.029541 1
  189.025375 9205.555664 10
  191.436423 799.813354 1
  192.786158 841.797363 1
  198.980534 1386.204590 2
  199.964151 2460.396484 3
  199.988193 3996.372559 4
  200.995989 2744.128662 3
  204.993376 945.932983 1
  206.987979 10802.596680 12
  207.972131 8745.119141 10
  207.988565 937.820068 1
  208.056587 3549.645996 4
  208.117835 731.062134 1
  213.048537 2408.534424 3
  214.913125 1451.259644 2
  215.024479 20514.281250 23
  216.990592 810.219116 1
  217.737118 806.328125 1
  217.930278 3971.971191 4
  222.952815 906.286499 1
  223.818889 765.402588 1
  224.988114 1022.731079 1
  224.998316 2870.491699 3
  227.959055 2233.365234 2
  228.042962 848.179810 1
  229.013520 3620.108887 4
  231.935298 911.265625 1
  232.923449 1475.624878 2
  233.034978 1543.824951 2
  233.315496 773.260986 1
  233.938208 1482.999268 2
  234.956891 3483.387939 4
  235.191134 681.003540 1
  235.967175 8863.209961 10
  236.517365 828.534180 1
  237.958144 939.223145 1
  241.457583 788.237671 1
  241.987977 1759.895264 2
  242.024253 5414.691895 6
  242.163740 918.784302 1
  242.880865 853.998779 1
  243.028251 2764.772705 3
  243.798840 712.700195 1
  244.003221 3137.690430 4
  244.033469 837.287231 1
  244.985519 4294.943848 5
  245.993441 2005.977539 2
  246.935000 2349.019775 3
  246.996594 848.186279 1
  247.411485 803.185669 1
  248.938266 1137.739136 1
  249.960251 2219.338867 2
  250.941221 1458.628662 2
  251.144124 892.495117 1
  251.296838 1004.640625 1
  252.992775 1102.586426 1
  253.225577 918.750244 1
  257.004643 878.695557 1
  259.014558 1024.783081 1
  259.053153 6949.325684 8
  261.029816 1903.394775 2
  264.991303 1326.020996 1
  265.007603 3613.914551 4
  265.010049 3966.898438 4
  265.990848 1197.486206 1
  266.924364 911.311768 1
  266.986993 1133.305176 1
  267.970510 1169.579102 1
  269.554643 812.586182 1
  270.612941 812.500977 1
  270.977486 922.777100 1
  274.880657 1055.046875 1
  275.018474 982.472046 1
  275.309952 873.316772 1
  278.912770 904.048462 1
  279.008719 2282.069824 3
  280.050616 1551.604004 2
  280.984422 1170.436523 1
  281.028030 1442.751953 2
  281.035151 72980.195313 82
  281.043162 808.187012 1
  281.055625 906.539551 1
  282.038310 6348.764648 7
  283.025258 989.041016 1
  285.949772 897.283203 1
  286.496864 852.378174 1
  286.944484 2301.705078 3
  289.007085 888.471436 1
  290.951311 1591.451294 2
  290.990695 808.073120 1
  291.043221 869.665649 1
  291.106082 994.320435 1
  291.113589 1296.943848 1
  291.122973 2550.644287 3
  291.130481 188787.687500 211
  291.135174 1867.074707 2
  291.137989 2420.270996 3
  291.146436 1653.163330 2
  291.154884 747.711792 1
  292.126901 1940.227783 2
  292.133505 14804.494141 17
  292.889651 1145.938232 1
  293.134134 1702.205078 2
  293.957959 732.290771 1
  295.939939 1428.495117 2
  296.226778 853.188232 1
  296.947638 3415.718750 4
  297.020159 1036.632568 1
  298.056716 1319.549927 1
  298.061577 11249.848633 13
  298.999050 991.487671 1
  299.044965 3120.872314 3
  299.450844 780.644775 1
  300.051885 28137.255859 31
  300.055813 2256.204346 3
  301.054029 2818.472900 3
  304.955211 1176.757813 1
  308.725592 1041.252441 1
  309.998279 777.753052 1
  310.011685 2964.831543 3
  310.789687 1080.866333 1
  310.995784 25610.847656 29
  311.000965 1870.832031 2
  311.012363 1288.542480 1
  311.066256 1063.813599 1
  311.167860 1694.893066 2
  311.999152 2604.252197 3
  312.169978 951.825684 1
  312.544411 826.183350 1
  313.099473 2936.512451 3
  313.112034 60507.445313 68
  313.120409 956.621460 1
  314.115151 5235.874023 6
  315.069203 924.458496 1
  315.088223 73952.007813 83
  315.096676 1375.706177 2
  316.072193 869.634033 1
  316.091303 8859.504883 10
  317.008520 939.153442 1
  317.035181 1054.473999 1
  317.091713 1199.354126 1
  317.862271 784.658569 1
  318.007934 2151.086426 2
  318.019720 8177.327637 9
  318.989477 1568.818237 2
  319.003470 17243.810547 19
  319.021771 1027.712646 1
  320.009096 899.543701 1
  320.986887 2334.114990 3
  321.001012 909.831787 1
  323.019567 1273.634766 1
  324.004587 1165.384766 1
  325.979296 754.761230 1
  327.014762 1412.495850 2
  328.022617 14886.690430 17
  329.029500 1620.576416 2
  329.076864 10608.138672 12
  329.085887 4732.945801 5
  331.898697 845.031128 1
  331.994678 1622.224731 2
  334.034922 1465.099976 2
  335.034875 2794.062500 3
  335.046462 2237.777100 2
  335.093972 8581.190430 10
  336.030015 20979.437500 23
  337.034271 1768.499268 2
  338.013681 1435.008179 2
  338.027771 758.920288 1
  343.053378 2774.932129 3
  344.041075 16420.677734 18
  344.061572 1105.356567 1
  345.048786 57213.175781 64
  345.167489 818.223145 1
  346.056066 12366.354492 14
  347.049439 2741.938965 3
  347.060433 2632.060791 3
  352.061087 2170.245605 2
  353.042848 9174.726563 10
  353.056634 18623.320313 21
  354.056410 1209.334473 1
  354.060186 1408.155273 2
  355.040215 3392.835449 4
  355.052854 1394.767822 2
  357.039284 3626.581543 4
  359.105422 939.750244 1
  361.093595 10367.584961 12
  362.096483 1184.490234 1
  362.664727 863.542847 1
  366.165990 1546.904175 2
  368.227854 869.649414 1
  370.867883 1293.745361 1
  374.248045 851.656982 1
  374.993271 1406.458740 2
  375.082464 9914.662109 11
  375.236224 769.602051 1
  376.084975 944.106567 1
  376.996069 2683.292236 3
  378.999620 1624.003906 2
  379.763285 1041.128296 1
  379.932525 1375.353516 2
  380.017887 1999.324951 2
  380.805692 807.542236 1
  381.026211 7619.955566 9
  381.099291 3044.862305 3
  383.022359 2933.210449 3
  386.877916 870.903687 1
  389.020293 4353.258301 5
  390.047218 2393.893799 3
  391.016852 2463.149414 3
  391.054836 5897.326172 7
  393.015573 2107.399414 2
  393.246784 775.798218 1
  398.065685 914.665283 1
  399.062380 6937.790039 8
  400.047705 1070.831055 1
  404.998708 1504.989868 2
  405.037208 905.398071 1
  405.083414 1776.811035 2
  405.118845 6132.652832 7
  407.099524 3817.688965 4
  408.212936 854.867676 1
  411.076363 3189.727783 4
  412.823483 1169.733154 1
  413.054947 4247.311523 5
  413.822071 843.876953 1
  416.656434 801.530640 1
  421.859363 797.584717 1
  427.043623 2376.300049 3
  431.034519 897.558472 1
  432.059222 1165.898315 1
  434.073485 2238.412842 3
  436.322189 765.585449 1
  442.007829 2142.531738 2
  444.131048 3371.849365 4
  446.120024 2458.428223 3
  456.596145 860.109863 1
  459.167324 5492.018555 6
  460.172785 1038.539673 1
  461.157229 41650.832031 47
  461.170326 773.153931 1
  462.141082 1169.291748 1
  462.159852 6468.927246 7
  475.146637 27278.416016 30
  476.150100 4298.320313 5
  477.150838 980.357178 1
  481.163568 15472.850586 17
  482.166157 2298.870605 3
  488.115566 1196.189087 1
  489.123623 3713.177979 4
  490.110205 29585.283203 33
  491.118280 60290.386719 67
  492.121218 9413.875000 11
  493.116887 3797.761719 4
  493.313485 956.728516 1
  495.115230 1855.303467 2
  497.129933 5508.211914 6
  498.130346 4471.649414 5
  499.112715 7262.713867 8
  499.125355 51525.937500 58
  500.129688 7467.484863 8
  501.109502 4065.500977 5
  501.122218 3700.838623 4
  503.107634 1995.067871 2
  507.161497 14761.355469 16
  507.208973 891.332397 1
  508.166386 1849.067871 2
  509.306704 1476.566162 2
  513.101939 1036.795410 1
  521.108347 931.291870 1
  523.845256 824.518555 1
  524.811564 806.271973 1
  526.085900 2918.756836 3
  532.820403 888.165894 1
  535.306085 2285.594727 3
  535.324805 1035.628662 1
  536.114277 2804.107666 3
  536.524930 987.929688 1
  536.733957 850.230835 1
  537.121802 982.441040 1
  537.302940 2211.328613 2
  539.988374 944.226196 1
  541.218497 1858.088867 2
  544.216300 1905.665771 2
  547.214894 3818.533691 4
  549.077005 1259.522461 1
  551.188154 1660.235596 2
  554.286545 894.695923 1
  555.123291 802.363159 1
  555.264169 1251.483521 1
  557.085565 1106.863281 1
  557.145191 3802.589844 4
  559.103218 2109.315186 2
  561.496168 852.919678 1
  563.300345 8615.367188 10
  564.304456 2767.443848 3
  567.113451 1464.180542 2
  576.155727 796.125854 1
  604.102592 915.002686 1
  607.174755 1132.978149 1
  607.225638 98205.781250 110
  608.230469 17900.718750 20
  608.928238 808.074097 1
  612.890704 846.905029 1
  617.239493 860.488403 1
  622.534672 891.695435 1
  628.782074 868.291260 1
  634.181541 1767.019775 2
  636.177672 42117.257813 47
  637.182312 8094.472168 9
  637.823974 915.058838 1
  638.183242 1792.209961 2
  643.195707 2559.320557 3
  658.161726 1563.561035 2
  659.170946 6095.904297 7
  660.172876 1145.497559 1
  667.175892 3802.024414 4
  667.319172 754.347168 1
  675.214827 1353.375610 2
  677.984589 845.375732 1
  683.582240 816.473999 1
  689.646246 828.079712 1
  699.097182 868.853516 1
  702.117265 686.275513 1
  705.287875 982.439087 1
  706.907872 823.563354 1
  714.348534 777.120850 1
  722.288560 897.249268 1
  726.994797 858.073730 1
  737.419490 856.743652 1
  746.368217 967.632568 1
  755.390605 1057.584595 1
  775.277301 1708.607788 2
  785.791038 846.250488 1
  786.957587 816.971313 1
  789.285922 902.978027 1
  796.957739 949.912720 1
  801.306856 807.603271 1
  801.341141 800.787231 1
  804.228948 4075.168945 5
  821.198623 985.598999 1
  822.208805 927.267334 1
  835.179596 1605.659546 2
  837.175915 3289.818604 4
  837.249142 918.843628 1
  838.183636 1407.417603 2
  845.182129 2642.158936 3
  853.218983 1009.974243 1
  853.675900 913.257202 1
  863.490798 2519.047119 3
  866.976883 838.745728 1
  867.633176 820.923096 1
  873.251628 814.980957 1
  889.991744 825.763428 1
  905.974967 5047.203125 6
  919.625532 1071.543579 1
  922.001115 820.227173 1
  925.331791 1019.508667 1
  948.580373 1024.216431 1
  953.283982 2072.336426 2
  954.703560 911.588623 1
  978.311450 856.059570 1
  979.410800 836.203125 1
  982.237084 1459.895142 2
  988.243352 816.652954 1
  989.253669 950.298340 1
  990.241988 958.408203 1
  997.612513 837.295654 1
  1005.969235 24462.869141 27
  1006.976678 4301.529297 5
  1019.689230 1194.985474 1
  1052.144236 951.870605 1
  1065.225103 981.234619 1
  1065.994028 1558.443481 2
  1073.928728 816.650757 1
  1074.214698 874.061035 1
  1105.902895 2335.408936 3
  1105.965432 21765.796875 24
  1106.897166 960.354614 1
  1106.966746 5385.501953 6
  1107.969421 1386.341675 2
  1120.583223 1007.662231 1
  1130.068833 829.226685 1
  1145.813278 1024.627563 1
  1165.985321 25538.224609 29
  1166.993939 4401.351074 5
  1167.988784 2106.856934 2
  1182.980837 1770.041016 2
  1183.349908 889.644775 1
  1193.450588 811.824829 1
  1205.956640 11196.315430 13
  1206.882904 1054.123169 1
  1206.962121 2068.418457 2
  1233.969956 4359.277344 5
  1234.969683 1141.206909 1
  1248.169096 796.086914 1
  1255.944988 3498.114258 4
  1256.954705 1714.594238 2
  1265.978062 44003.699219 49
  1266.982865 15693.500000 18
  1267.988864 2030.050537 2
  1282.963258 4928.186523 6
  1283.979661 1273.939331 1
  1303.896633 824.262451 1
  1305.944986 2606.067383 3
  1327.381722 876.738770 1
  1333.966349 9151.844727 10
  1334.961032 2121.846436 2
  1341.314449 984.647583 1
  1352.173799 853.059326 1
  1355.939238 1465.422974 2
  1365.145538 999.651123 1
  1365.974981 33009.070313 37
  1366.022673 959.509644 1
  1366.977040 8795.598633 10
  1369.185454 968.617676 1
  1380.860635 1098.851318 1
  1382.957032 2860.038574 3
  1383.987566 927.974243 1
  1391.194452 1032.991577 1
  1400.970784 1194.010254 1
  1405.867762 921.434204 1
  1433.958002 7745.827148 9
  1434.963914 2807.608887 3
  1441.042345 1165.291382 1
  1446.442076 1073.382690 1
  1455.925551 1132.487183 1
  1456.135487 831.560791 1
  1460.786685 1119.538330 1
  1465.969084 14077.225586 16
  1466.966411 4126.279785 5
  1467.975382 1258.319336 1
  1482.955151 1077.600220 1
  1487.930711 931.886475 1