ACCESSION: MSBNK-Fac_Eng_Univ_Tokyo-JP011635
RECORD_TITLE: (-)-CINCHONIDINE; EI-B; MS
DATE: 2016.01.19 (Created 2008.10.21, modified 2011.05.06)
AUTHORS: YAMAMOTO M, DEP. CHEMISTRY, FAC. SCIENCE, NARA WOMEN'S UNIV.
LICENSE: CC BY-NC-SA

CH$NAME: (-)-CINCHONIDINE
CH$COMPOUND_CLASS: N/A
CH$FORMULA: C19H22N2O
CH$EXACT_MASS: 294.17321
CH$SMILES: N/A
CH$IUPAC: N/A
CH$LINK: CAS 485-71-2
CH$LINK: NIKKAJI J6.003H

AC$INSTRUMENT: HITACHI M-2500
AC$INSTRUMENT_TYPE: EI-B
AC$MASS_SPECTROMETRY: MS_TYPE MS
AC$MASS_SPECTROMETRY: ION_MODE POSITIVE
AC$MASS_SPECTROMETRY: IONIZATION_ENERGY 70 eV

MS$FOCUSED_ION: ION_TYPE [M]+*

PK$SPLASH: splash10-000i-2900000000-911c9ae18b7913977ba7
PK$NUM_PEAK: 24
PK$PEAK: m/z int. rel.int.
  39 1.11 11
  41 3.45 35
  42 4.4 44
  53 1.92 19
  55 3.65 37
  56 1.36 14
  67 1.31 13
  77 1.99 20
  79 2.63 26
  80 1.08 11
  81 6.8 68
  82 2.26 23
  94 1.06 11
  95 2.25 23
  128 1.67 17
  129 1.53 15
  130 4.48 45
  136 99.99 999
  137 10.38 104
  138 1.17 12
  142 1.24 12
  143 1.41 14
  158 1.82 18
  159 5.25 53