ACCESSION: MSBNK-Fac_Eng_Univ_Tokyo-JP010751
RECORD_TITLE: N,N-DIMETHYL-PARA-TOLUIDINE; EI-B; MS
DATE: 2016.01.19 (Created 2008.10.21, modified 2011.05.06)
AUTHORS: YAMAMOTO M, DEP. CHEMISTRY, FAC. SCIENCE, NARA WOMEN'S UNIV.
LICENSE: CC BY-NC-SA

CH$NAME: N,N-DIMETHYL-PARA-TOLUIDINE
CH$COMPOUND_CLASS: N/A
CH$FORMULA: C9H13N
CH$EXACT_MASS: 135.10480
CH$SMILES: Cc(c1)ccc(c1)N(C)C
CH$IUPAC: InChI=1S/C9H13N/c1-8-4-6-9(7-5-8)10(2)3/h4-7H,1-3H3
CH$LINK: INCHIKEY GYVGXEWAOAAJEU-UHFFFAOYSA-N
CH$LINK: COMPTOX DTXSID0021832

AC$INSTRUMENT: HITACHI RMU-6M
AC$INSTRUMENT_TYPE: EI-B
AC$MASS_SPECTROMETRY: MS_TYPE MS
AC$MASS_SPECTROMETRY: ION_MODE POSITIVE
AC$MASS_SPECTROMETRY: IONIZATION_ENERGY 70 eV

MS$FOCUSED_ION: ION_TYPE [M]+*

PK$SPLASH: splash10-001i-5900000000-93a9f72d75f5fa56dff2
PK$NUM_PEAK: 45
PK$PEAK: m/z int. rel.int.
  15 2.4 24
  27 2 20
  28 1.3 13
  38 0.1 1
  39 6.7 67
  40 1 10
  41 2.4 24
  42 0.61 6
  44 2.4 24
  50 2.2 22
  51 5.1 51
  52 0.24 2
  53 1.3 13
  55 1 10
  58.5 1.7 17
  62 0.13 1
  63 4.4 44
  64 1.3 13
  65 10.1 101
  66 0.17 2
  66.5 6.7 67
  67 2 20
  67.5 4.7 47
  76 0.1 1
  77 5.7 57
  78 2.7 27
  79 1.7 17
  89 0.34 3
  90 2 20
  91 19.2 192
  92 3.7 37
  93 0.2 2
  104 1 10
  105 1.7 17
  106 1 10
  117 0.13 1
  118 12.1 121
  119 13.5 135
  120 6.1 61
  121 0.1 1
  132 1.7 17
  133 2.7 27
  134 99.99 999
  135 7.54 75
  136 7.7 77